{"text_format":"1","workbook":"xlsx","n_sheets":9,"sheets":["CAPA","GLOSSÁRIO","ENTRADA","SCHÄFFLER","DELONG","WRC","BALMFORTH","Plan2","MATERIAIS"],"not_rendered":{"charts":7,"images":22,"macros":1,"external_links":0,"defined_names":10,"comments":1,"pivot_tables":0},"unopened":[],"bounds":{"document_bytes":16777216,"sheet_cells":100000,"rows_first":2000,"rows_last":500,"rows_between":2000,"halvings":0,"cell_chars":16384,"cell_head_chars":4096},"cells_cut":0,"cells_raw":0,"read":"whole","date_system":"1900"}

{"sheet":"CAPA","index":0,"n_rows":2,"n_cols":15,"rows_kept":2,"cut":false,"hidden":false,"merged":[]}
[]
[" ",null,"GLOSSÁRIO",null,"ENTRADA",null,"SCHÄFFLER",null,"DELONG",null,"WRC",null,"BALMFORTH",null,"MATERIAIS"]

{"sheet":"GLOSSÁRIO","index":1,"n_rows":188,"n_cols":4,"rows_kept":188,"cut":false,"hidden":false,"merged":[]}
[]
[null,"SOLDINOX®",null,"CAPA"]
[]
[]
[null,"O SOLDINOX® é uma ferramenta matemática de simulação de soldas em ligas ferrosas em geral. Seu objetivo é prever a microestrutura final da poça de fusão, bem como "]
["estimar a dimensão e características da ZTA (zona termicamente afetada)."]
[]
[null,"Com base em diversos estudos, a microestrutura final é dependente do teor dos elementos de liga envolvidos. Observou-se empiricamente que o níquel induz à solidificação"]
["na forma austenítica (CFC), enquanto que o cromo favorece a ferrita (CCC). Notou-se, também, que os demais elementos de liga mais comuns tendem a se enquadrar nestas duas"]
["formas de estrutura final, favorecendo uma ou outra microestrutura, em maior ou menor grau. Com base nisso, se tornou possível correlacionar a composição química do metal "]
["(ou metais) de base, bem como dos consumíveis, à microestrutura final, com base no par ordenado Cromo Equivalente (Creq.) e Níquel Equivalente (Nieq.)."]
[]
[null,"A partir daí, diversos estudos deram origem aos diagramas de Schäffler, DeLong, WRC e Balmforth, que serão melhor detalhados a seguir."]
[]
[null,"ABAS DO SOLDINOX®:"]
[]
[]
[null,"ENTRADA - Interface de interação inicial entre o usuário e o SOLDINOX®, onde são informados os dados referentes aos materiais e consumíveis de solda - especificações e "]
["composição química pertinente - bem como os parâmetros de solda a serem implementados. Há espaço para a inclusão de 5 (cinco) materiais diferentes entre metais-base e "]
["consumíveis. Por exemplo, para uma soldagem dissimilar, onde duas ligas diferentes devam ser unidas, há possibilidade de simular ou mesclar até 3 (três) consumíveis diferentes."]
["Estas informações são utilizadas nas outras abas, para a previsão da microestrutura de acordo com a situação."]
["Os parâmetros de soldagem apresentarão o resultado na própria aba ENTRADA, que é a posição da temperatura de interesse no momento da soldagem. Esta posição é capaz"]
["de estimar uma possível origem de defeitos de microestrutura na ZTA, mediante a aplicação da equação de Adams."]
[" Todos os campos com fundo amarelo são editáveis."]
[]
[null,"As demais abas possuem como característica comum o carregamento das composições químicas de todos os metais-base e consumíveis dispostos na ENTRADA nas"]
["linhas 1 a 5, que podem ser livremente escolhidos na coluna ESPECIFICAÇÃO, bem como permite a composição ponderada de dois ou três materiais/consumíveis, nas linhas 6 a 10."]
["Tal ponderação é possibilitada pela diluição [coluna TEOR (%)]. Todos os campos com fundo azul são editáveis."]
[]
[]
[null,"SCHÄFFLER - A mais antiga equação para cromo equivalente e níquel equivalente, elaborada em 1949, obtidos da seguinte forma:"]
[]
[null,null,"Creq. = Cr + Mo + 1,5*Si +0,5*#, (onde # pode ser nióbio, titânio, etc.)"]
[]
[null,null,"Nieq. = Ni + 30*C + 0,5*Mn"]
[]
[]
[]
[]
[]
[]
[]
[]
[]
[]
[]
[]
[]
[]
[]
[]
[]
[]
[]
[]
[]
[]
[]
[]
[null,"Regiões do gráfico:"]
[]
[null,"1) Formação de trincas de solidificação ou por perda de ductilidade acima de 1250 ºC;"]
[null,"2) Fragilização por formação de fases intermetálicas após aquecimento entre cerca de 450 e 900 ºC;"]
[null,"3) Fragilização por crescimento de grão;"]
[null,"4) Fragilização e fissuração por formação de martensita."]
[]
[null,"Pode-se observar, na parte central, na região de coexistência da ferrita e austenita, uma pequena área triangular que não é atingida por nenhum dos problemas "]
["indicados. De uma forma geral, os consumíveis de aços inoxidáveis austeníticos são projetados para, após diluição com o metal-base, fornecer uma solda cuja composição química "]
["resulte nesta região."]
[]
[]
[null,"DELONG - Em 1956, percebeu-se que a presença de nitrogênio na solda, seja por contaminação nos materiais ou atmosférica, é um importante fator austenitizante "]
["da poça de fusão, fato este ignorado por Schäffler. Desta forma, o cálculo de níquel equivalente é alterado da seguinte maneira:"]
[]
[null,null,"Nieq. = Ni + 30*C + 0,5*Mn + 30*N"]
[]
[]
[]
[]
[]
[]
[]
[]
[]
[]
[]
[]
[]
[]
[]
[]
[]
[]
[]
[]
[]
[]
[]
[]
[]
[]
[null,"Esta alteração só é significativa na região Creq. x Nieq. destacada no diagrama de DeLong."]
[]
[]
[null,"WRC - De 1992. Permite prever a estrutura da poça de solidificação que utiliza os cálculos de Creq. e Nieq."]
[]
[]
[]
[]
[]
[]
[]
[]
[]
[]
[]
[]
[]
[]
[]
[]
[]
[]
[]
[]
[]
[]
[]
[]
[]
[]
[]
[null,"Esta alteração só é significativa na região Creq. x Nieq. destacada no diagrama WRC."]
[null,"O diagrama WRC leva em consideração o efeito austenitizante (níquel equivalente) do cobre."]
[null,"Neste diagrama observa-se 4 formas de solidificação:"]
[]
[null,"A = austenita como fase primária e monofásica;"]
[null,"F = ferrita como fase primária e monofásica;"]
[null,"AF = austenita primária e um eutético de austenita e ferrita no espaço interdendrítico;"]
[null,"FA = ferrita primária e um eutético de austenita e ferrita no espaço interdendrítico."]
[]
[]
[null,"BALMFORTH - Diagrama desenvolvido por Balmforth que representa um incremento significativo na previsão do teor de ferrita dos aços inoxidáveis martensíticos."]
[]
[]
[]
[]
[]
[]
[]
[]
[]
[]
[]
[]
[]
[]
[]
[]
[]
[]
[]
[]
[]
[]
[]
[]
[]
[]
[null,"MATERIAIS"]
[]
[null,"Banco de dados que contempla os metais-base e consumíveis de soldagem mais comuns para aplicações em aços inoxidáveis. Há espaço previsto para cadastro de novos"]
["materiais, de acordo com a necessidade do usuário. A coluna \"ESPECIFICAÇÃO\" é reservada para o nome do material, norma aplicada, etc. A coluna \"TIPO\" serve para classificar os "]
["materiais, conforme a tabela abaixo:"]
[]
[null,"SIGLA","CLASSE"]
[null,"A","AUSTENÍTICO"]
[null,"F","FERRÍTICO"]
[null,"M","MARTENSÍTICO"]
[null,"D","DUPLEX"]
[null,"SA","SUPER-AUSTENÍTICO"]
[null,"SF","SUPER-FERRÍTICO"]
[null,"SM","SUPER-MARTENSÍTICO"]
[null,"BL","BAIXA LIGA"]
[null,"EP","ENDURECÍVEL POR PRECIPITAÇÃO"]
[null,"EA","ELETRODO AUSTENÍTICO"]
[]
[null,"As demais colunas se referem aos teores dos diversos elementos químicos de interesse. São valores médios."]

{"sheet":"ENTRADA","index":2,"n_rows":21,"n_cols":20,"rows_kept":21,"cut":false,"hidden":false,"merged":[[14,3,14,4],[14,5,14,6],[14,7,14,8],[14,9,14,10],[20,15,20,16],[20,17,20,18],[20,19,20,20],[19,11,19,12],[19,13,19,14],[19,15,19,16],[19,17,19,18],[19,19,19,20],[18,15,18,16],[18,17,18,18],[18,19,18,20],[18,11,18,12],[18,13,18,14],[20,11,20,12],[20,13,20,14],[14,19,14,20],[15,19,15,20],[16,19,16,20],[17,11,17,12],[17,13,17,14],[17,15,17,16],[17,17,17,18],[17,19,17,20],[14,15,14,16],[15,15,15,16],[16,15,16,16],[14,17,14,18],[15,17,15,18],[16,17,16,18],[14,11,14,12],[15,11,15,12],[16,11,16,12],[14,13,14,14],[15,13,15,14],[16,13,16,14],[19,7,19,8],[20,7,20,8],[15,9,15,10],[16,9,16,10],[17,9,17,10],[18,9,18,10],[19,9,19,10],[20,9,20,10],[15,7,15,8],[16,7,16,8],[17,7,17,8],[18,7,18,8],[19,3,19,4],[20,3,20,4],[15,5,15,6],[16,5,16,6],[17,5,17,6],[18,5,18,6],[19,5,19,6],[20,5,20,6],[15,3,15,4],[16,3,16,4],[17,3,17,4],[18,3,18,4],[9,19,9,20],[10,19,10,20],[11,19,11,20],[13,1,13,14],[9,11,9,12],[10,11,10,12],[11,11,11,12],[9,13,9,18],[10,13,10,18],[11,13,11,18],[9,3,9,4],[10,3,10,4],[11,3,11,4],[12,3,12,4],[9,5,9,10],[10,5,10,10],[11,5,11,10],[6,17,6,18],[3,7,3,8],[4,7,4,8],[5,7,5,8],[6,7,6,8],[7,7,7,8],[3,9,3,10],[4,9,4,10],[5,9,5,10],[6,9,6,10],[7,9,7,10],[6,19,6,20],[4,15,4,16],[4,17,4,18],[4,19,4,20],[5,17,5,18],[5,19,5,20],[6,5,6,6],[8,3,8,4],[8,5,8,6],[8,11,8,12],[8,13,8,14],[8,15,8,16],[8,17,8,18],[8,19,8,20],[7,3,7,4],[7,5,7,6],[7,11,7,12],[7,13,7,14],[7,15,7,16],[7,17,7,18],[8,7,8,8],[8,9,8,10],[6,13,6,14],[6,15,6,16],[1,3,1,4],[9,1,12,1],[2,3,2,20],[13,15,13,16],[3,1,8,1],[4,3,4,4],[4,5,4,6],[4,11,4,12],[4,13,4,14],[6,3,6,4],[3,3,3,4],[3,5,3,6],[3,11,3,12],[3,13,3,14],[3,15,3,16],[3,17,3,18],[6,11,6,12],[5,3,5,4],[5,5,5,6],[5,11,5,12],[5,13,5,14],[5,15,5,16],[7,19,7,20],[3,19,3,20]]}
[]
[null,null,null,"CAPA"]
[null,null,null,"COMPOSIÇÃO QUÍMICA MÉDIA (%)"]
[null,"MATERIAIS E CONSUMÍVEIS","ESPECIFICAÇÃO","Carbono (C)",null,"Cobre (Cu)",null,"Cromo (Cr)",null,"Manganês (Mn)",null,"Molibdênio (Mo)",null,"Níquel (Ni)",null,"Nitrogênio (N)",null,"Silício (Si)",null,"Outros*"]
[null,null,"AÇO ESTRUTURAL CASO HDT",8.6999999999999994E-2,null,6.3E-2,null,5.8730000000000002,null,0.873,null,1.9730000000000001,null,0.61,null,1.2E-2,null,1.1599999999999999,null,0.79]
[null,null,"AWS ER309L",0.03,null,0.75,null,24,null,1.75,null,0.75,null,13,null,0,null,0.47499999999999998,null,0]
[null,null,"AWS ER347",0.08,null,0,null,19,null,1,null,1.2,null,15,null,0.13,null,1.5,null,0.8]
[null,null,null,"",null,"",null,"",null,"",null,"",null,"",null,"",null,"",null,""]
[null,null,null,"",null,"",null,"",null,"",null,"",null,"",null,"",null,"",null,""]
[null,"PARÂMETROS DE SOLDAGEM","Temperatura inicial da chapa (ºC):",35,null,"Eficiência de transferência de calor:",null,null,null,null,null,1,null,"Velocidade de soldagem (mm/s):",null,null,null,null,null,10]
[null,null,"Temperatura de fusão (ºC):",1500,null,"Tensão de soldagem (V):",null,null,null,null,null,40,null,"Densidade do material (g/cm³):",null,null,null,null,null,7.85]
[null,null,"Temperatura de interesse (ºC):",770,null,"Corrente de soldagem (A):",null,null,null,null,null,600,null,"Calor específico do metal-base (J/g.ºC):",null,null,null,null,null,12]
[null,null,"Espessura da chapa (mm):",9.5,null,"* Titânio (Ti), Nióbio (Nb), etc."]
[null,"POSIÇÃO DA TEMPERATURA DE INTERESSE (Equação de Adams - mm):",null,null,null,null,null,null,null,null,null,null,null,null,null,{"$f":"IF((OR(D10=\"\",D11=\"\",D12=\"\",D13=\"\",T10=\"\",T11=\"\",T12=\"\")),(\"\"),((((1/(D12-D10))-(1/(D11-D10)))*(L10*L11*L12*1000))/(4.13*T10*T11*T12*D13)))","v":0.4402350111693687}]
[null,null,null,3,null,4,null,5,null,6,null,7,null,8,null,9,null,10,null,11]
[null,null,"ESPECIFICAÇÃO","Carbono (C)",null,"Cobre (Cu)",null,"Cromo (Cr)",null,"Manganês (Mn)",null,"Molibdênio (Mo)",null,"Níquel (Ni)",null,"Nitrogênio (N)",null,"Silício (Si)",null,"Outros (Nb, Ti, Al, etc.)"]
[null,null,{"$f":"C5","v":"AÇO ESTRUTURAL CASO HDT"},{"$f":"IF((OR(($C17=0),($C17=\"\"))),(\"\"),(VLOOKUP($C17,MATERIAIS!$B$5:$L$623,D$15,0)))","v":8.6999999999999994E-2},null,{"$f":"IF((OR(($C17=0),($C17=\"\"))),(\"\"),(VLOOKUP($C17,MATERIAIS!$B$5:$L$623,F$15,0)))","v":6.3E-2},null,{"$f":"IF((OR(($C17=0),($C17=\"\"))),(\"\"),(VLOOKUP($C17,MATERIAIS!$B$5:$L$623,H$15,0)))","v":5.8730000000000002},null,{"$f":"IF((OR(($C17=0),($C17=\"\"))),(\"\"),(VLOOKUP($C17,MATERIAIS!$B$5:$L$623,J$15,0)))","v":0.873},null,{"$f":"IF((OR(($C17=0),($C17=\"\"))),(\"\"),(VLOOKUP($C17,MATERIAIS!$B$5:$L$623,L$15,0)))","v":1.9730000000000001},null,{"$f":"IF((OR(($C17=0),($C17=\"\"))),(\"\"),(VLOOKUP($C17,MATERIAIS!$B$5:$L$623,N$15,0)))","v":0.61},null,{"$f":"IF((OR(($C17=0),($C17=\"\"))),(\"\"),(VLOOKUP($C17,MATERIAIS!$B$5:$L$623,P$15,0)))","v":1.2E-2},null,{"$f":"IF((OR(($C17=0),($C17=\"\"))),(\"\"),(VLOOKUP($C17,MATERIAIS!$B$5:$L$623,R$15,0)))","v":1.1599999999999999},null,{"$f":"IF((OR(($C17=0),($C17=\"\"))),(\"\"),(VLOOKUP($C17,MATERIAIS!$B$5:$L$623,T$15,0)))","v":0.79}]
[null,null,{"$f":"C6","v":"AWS ER309L"},{"$f":"IF((OR(($C18=0),($C18=\"\"))),(\"\"),(VLOOKUP($C18,MATERIAIS!$B$5:$L$623,D$15,0)))","v":0.03},null,{"$f":"IF((OR(($C18=0),($C18=\"\"))),(\"\"),(VLOOKUP($C18,MATERIAIS!$B$5:$L$623,F$15,0)))","v":0.75},null,{"$f":"IF((OR(($C18=0),($C18=\"\"))),(\"\"),(VLOOKUP($C18,MATERIAIS!$B$5:$L$623,H$15,0)))","v":24},null,{"$f":"IF((OR(($C18=0),($C18=\"\"))),(\"\"),(VLOOKUP($C18,MATERIAIS!$B$5:$L$623,J$15,0)))","v":1.75},null,{"$f":"IF((OR(($C18=0),($C18=\"\"))),(\"\"),(VLOOKUP($C18,MATERIAIS!$B$5:$L$623,L$15,0)))","v":0.75},null,{"$f":"IF((OR(($C18=0),($C18=\"\"))),(\"\"),(VLOOKUP($C18,MATERIAIS!$B$5:$L$623,N$15,0)))","v":13},null,{"$f":"IF((OR(($C18=0),($C18=\"\"))),(\"\"),(VLOOKUP($C18,MATERIAIS!$B$5:$L$623,P$15,0)))","v":0},null,{"$f":"IF((OR(($C18=0),($C18=\"\"))),(\"\"),(VLOOKUP($C18,MATERIAIS!$B$5:$L$623,R$15,0)))","v":0.47499999999999998},null,{"$f":"IF((OR(($C18=0),($C18=\"\"))),(\"\"),(VLOOKUP($C18,MATERIAIS!$B$5:$L$623,T$15,0)))","v":0}]
[null,null,{"$f":"C7","v":"AWS ER347"},{"$f":"IF((OR(($C19=0),($C19=\"\"))),(\"\"),(VLOOKUP($C19,MATERIAIS!$B$5:$L$623,D$15,0)))","v":0.08},null,{"$f":"IF((OR(($C19=0),($C19=\"\"))),(\"\"),(VLOOKUP($C19,MATERIAIS!$B$5:$L$623,F$15,0)))","v":0},null,{"$f":"IF((OR(($C19=0),($C19=\"\"))),(\"\"),(VLOOKUP($C19,MATERIAIS!$B$5:$L$623,H$15,0)))","v":19},null,{"$f":"IF((OR(($C19=0),($C19=\"\"))),(\"\"),(VLOOKUP($C19,MATERIAIS!$B$5:$L$623,J$15,0)))","v":1},null,{"$f":"IF((OR(($C19=0),($C19=\"\"))),(\"\"),(VLOOKUP($C19,MATERIAIS!$B$5:$L$623,L$15,0)))","v":1.2},null,{"$f":"IF((OR(($C19=0),($C19=\"\"))),(\"\"),(VLOOKUP($C19,MATERIAIS!$B$5:$L$623,N$15,0)))","v":15},null,{"$f":"IF((OR(($C19=0),($C19=\"\"))),(\"\"),(VLOOKUP($C19,MATERIAIS!$B$5:$L$623,P$15,0)))","v":0.13},null,{"$f":"IF((OR(($C19=0),($C19=\"\"))),(\"\"),(VLOOKUP($C19,MATERIAIS!$B$5:$L$623,R$15,0)))","v":1.5},null,{"$f":"IF((OR(($C19=0),($C19=\"\"))),(\"\"),(VLOOKUP($C19,MATERIAIS!$B$5:$L$623,T$15,0)))","v":0.8}]
[null,null,{"$f":"C8","v":0},{"$f":"IF((OR(($C20=0),($C20=\"\"))),(\"\"),(VLOOKUP($C20,MATERIAIS!$B$5:$L$623,D$15,0)))","v":""},null,{"$f":"IF((OR(($C20=0),($C20=\"\"))),(\"\"),(VLOOKUP($C20,MATERIAIS!$B$5:$L$623,F$15,0)))","v":""},null,{"$f":"IF((OR(($C20=0),($C20=\"\"))),(\"\"),(VLOOKUP($C20,MATERIAIS!$B$5:$L$623,H$15,0)))","v":""},null,{"$f":"IF((OR(($C20=0),($C20=\"\"))),(\"\"),(VLOOKUP($C20,MATERIAIS!$B$5:$L$623,J$15,0)))","v":""},null,{"$f":"IF((OR(($C20=0),($C20=\"\"))),(\"\"),(VLOOKUP($C20,MATERIAIS!$B$5:$L$623,L$15,0)))","v":""},null,{"$f":"IF((OR(($C20=0),($C20=\"\"))),(\"\"),(VLOOKUP($C20,MATERIAIS!$B$5:$L$623,N$15,0)))","v":""},null,{"$f":"IF((OR(($C20=0),($C20=\"\"))),(\"\"),(VLOOKUP($C20,MATERIAIS!$B$5:$L$623,P$15,0)))","v":""},null,{"$f":"IF((OR(($C20=0),($C20=\"\"))),(\"\"),(VLOOKUP($C20,MATERIAIS!$B$5:$L$623,R$15,0)))","v":""},null,{"$f":"IF((OR(($C20=0),($C20=\"\"))),(\"\"),(VLOOKUP($C20,MATERIAIS!$B$5:$L$623,T$15,0)))","v":""}]
[null,null,{"$f":"C9","v":0},{"$f":"IF((OR(($C21=0),($C21=\"\"))),(\"\"),(VLOOKUP($C21,MATERIAIS!$B$5:$L$623,D$15,0)))","v":""},null,{"$f":"IF((OR(($C21=0),($C21=\"\"))),(\"\"),(VLOOKUP($C21,MATERIAIS!$B$5:$L$623,F$15,0)))","v":""},null,{"$f":"IF((OR(($C21=0),($C21=\"\"))),(\"\"),(VLOOKUP($C21,MATERIAIS!$B$5:$L$623,H$15,0)))","v":""},null,{"$f":"IF((OR(($C21=0),($C21=\"\"))),(\"\"),(VLOOKUP($C21,MATERIAIS!$B$5:$L$623,J$15,0)))","v":""},null,{"$f":"IF((OR(($C21=0),($C21=\"\"))),(\"\"),(VLOOKUP($C21,MATERIAIS!$B$5:$L$623,L$15,0)))","v":""},null,{"$f":"IF((OR(($C21=0),($C21=\"\"))),(\"\"),(VLOOKUP($C21,MATERIAIS!$B$5:$L$623,N$15,0)))","v":""},null,{"$f":"IF((OR(($C21=0),($C21=\"\"))),(\"\"),(VLOOKUP($C21,MATERIAIS!$B$5:$L$623,P$15,0)))","v":""},null,{"$f":"IF((OR(($C21=0),($C21=\"\"))),(\"\"),(VLOOKUP($C21,MATERIAIS!$B$5:$L$623,R$15,0)))","v":""},null,{"$f":"IF((OR(($C21=0),($C21=\"\"))),(\"\"),(VLOOKUP($C21,MATERIAIS!$B$5:$L$623,T$15,0)))","v":""}]

{"sheet":"SCHÄFFLER","index":3,"n_rows":31,"n_cols":16,"rows_kept":31,"cut":false,"hidden":false,"merged":[[21,1,23,1],[9,2,11,2],[12,2,14,2],[15,2,17,2],[18,2,20,2],[21,2,23,2],[15,1,17,1],[9,1,11,1],[15,5,17,5],[15,6,17,6],[15,7,17,7],[15,8,17,8],[18,1,20,1],[18,5,20,5],[18,6,20,6],[18,7,20,7],[18,8,20,8],[9,9,11,9],[9,10,11,10],[9,11,11,11],[12,1,14,1],[12,5,14,5],[12,6,14,6],[12,7,14,7],[12,8,14,8],[3,2,3,3],[4,2,4,3],[5,2,5,3],[6,2,6,3],[7,2,7,3],[8,2,8,3],[9,6,11,6],[21,10,23,10],[21,11,23,11],[21,12,23,12],[9,7,11,7],[9,8,11,8],[15,9,17,9],[15,10,17,10],[15,11,17,11],[15,12,17,12],[9,12,11,12],[12,9,14,9],[12,10,14,10],[12,11,14,11],[12,12,14,12],[1,7,1,8],[21,13,23,13],[21,5,23,5],[21,6,23,6],[21,7,23,7],[21,8,23,8],[21,9,23,9],[9,13,11,13],[12,13,14,13],[15,13,17,13],[18,9,20,9],[18,10,20,10],[18,11,20,11],[18,12,20,12],[18,13,20,13],[9,5,11,5]]}
[]
[null,"DIAGRAMA DE SCHÄFFLER",null,null,null,null,null,"CAPA"]
[null,null,null,null,null,5,6,7,8,9,10,11]
[null,"Nº","ESPECIFICAÇÃO",null,"TEOR (%)","Cr","Mo","Si","*","Ni","C","Mn","Creq.","Nieq."]
[null,1,"AÇO ESTRUTURAL CASO HDT",null,100,{"$f":"IF((C5=\"\"),(\"\"),(VLOOKUP(C5,ENTRADA!$C$5:$U$9,6,0)))","v":5.8730000000000002},{"$f":"IF((C5=\"\"),(\"\"),(VLOOKUP(C5,ENTRADA!$C$5:$U$9,10,0)))","v":1.9730000000000001},{"$f":"IF((C5=\"\"),(\"\"),(VLOOKUP(C5,ENTRADA!$C$5:$U$9,16,0)))","v":1.1599999999999999},{"$f":"IF((C5=\"\"),(\"\"),(VLOOKUP(C5,ENTRADA!$C$5:$U$9,18,0)))","v":0.79},{"$f":"IF((C5=\"\"),(\"\"),(VLOOKUP(C5,ENTRADA!$C$5:$U$9,12,0)))","v":0.61},{"$f":"IF((C5=\"\"),(\"\"),(VLOOKUP(C5,ENTRADA!$C$5:$U$9,2,0)))","v":8.6999999999999994E-2},{"$f":"IF((C5=\"\"),(\"\"),(VLOOKUP(C5,ENTRADA!$C$5:$U$9,8,0)))","v":0.873},{"$f":"IF((C5=\"\"),(0),(F5+G5+1.5*H5+0.5*I5))","v":9.9809999999999999},{"$f":"IF((C5=\"\"),(0),(J5+30*K5+0.5*L5))","v":3.6564999999999999}]
[null,2,"AWS ER309L",null,100,{"$f":"IF((C6=\"\"),(\"\"),(VLOOKUP(C6,ENTRADA!$C$5:$U$9,6,0)))","v":24},{"$f":"IF((C6=\"\"),(\"\"),(VLOOKUP(C6,ENTRADA!$C$5:$U$9,10,0)))","v":0.75},{"$f":"IF((C6=\"\"),(\"\"),(VLOOKUP(C6,ENTRADA!$C$5:$U$9,16,0)))","v":0.47499999999999998},{"$f":"IF((C6=\"\"),(\"\"),(VLOOKUP(C6,ENTRADA!$C$5:$U$9,18,0)))","v":0},{"$f":"IF((C6=\"\"),(\"\"),(VLOOKUP(C6,ENTRADA!$C$5:$U$9,12,0)))","v":13},{"$f":"IF((C6=\"\"),(\"\"),(VLOOKUP(C6,ENTRADA!$C$5:$U$9,2,0)))","v":0.03},{"$f":"IF((C6=\"\"),(\"\"),(VLOOKUP(C6,ENTRADA!$C$5:$U$9,8,0)))","v":1.75},25.462499999999999,14.775]
[null,3,"AWS ER347",null,100,{"$f":"IF((C7=\"\"),(\"\"),(VLOOKUP(C7,ENTRADA!$C$5:$U$9,6,0)))","v":19},{"$f":"IF((C7=\"\"),(\"\"),(VLOOKUP(C7,ENTRADA!$C$5:$U$9,10,0)))","v":1.2},{"$f":"IF((C7=\"\"),(\"\"),(VLOOKUP(C7,ENTRADA!$C$5:$U$9,16,0)))","v":1.5},{"$f":"IF((C7=\"\"),(\"\"),(VLOOKUP(C7,ENTRADA!$C$5:$U$9,18,0)))","v":0.8},{"$f":"IF((C7=\"\"),(\"\"),(VLOOKUP(C7,ENTRADA!$C$5:$U$9,12,0)))","v":15},{"$f":"IF((C7=\"\"),(\"\"),(VLOOKUP(C7,ENTRADA!$C$5:$U$9,2,0)))","v":0.08},{"$f":"IF((C7=\"\"),(\"\"),(VLOOKUP(C7,ENTRADA!$C$5:$U$9,8,0)))","v":1},22.849999999999998,17.899999999999999]
[null,4,null,null,100,{"$f":"IF((C8=\"\"),(\"\"),(VLOOKUP(C8,ENTRADA!$C$5:$U$9,6,0)))","v":""},{"$f":"IF((C8=\"\"),(\"\"),(VLOOKUP(C8,ENTRADA!$C$5:$U$9,10,0)))","v":""},{"$f":"IF((C8=\"\"),(\"\"),(VLOOKUP(C8,ENTRADA!$C$5:$U$9,16,0)))","v":""},{"$f":"IF((C8=\"\"),(\"\"),(VLOOKUP(C8,ENTRADA!$C$5:$U$9,18,0)))","v":""},{"$f":"IF((C8=\"\"),(\"\"),(VLOOKUP(C8,ENTRADA!$C$5:$U$9,12,0)))","v":""},{"$f":"IF((C8=\"\"),(\"\"),(VLOOKUP(C8,ENTRADA!$C$5:$U$9,2,0)))","v":""},{"$f":"IF((C8=\"\"),(\"\"),(VLOOKUP(C8,ENTRADA!$C$5:$U$9,8,0)))","v":""},{"$f":"IF((C8=\"\"),(0),(F8+G8+1.5*H8+0.5*I8))","v":0},{"$f":"IF((C8=\"\"),(0),(J8+30*K8+0.5*L8))","v":0}]
[null,5,null,null,100,{"$f":"IF((C9=\"\"),(\"\"),(VLOOKUP(C9,ENTRADA!$C$5:$U$9,6,0)))","v":""},{"$f":"IF((C9=\"\"),(\"\"),(VLOOKUP(C9,ENTRADA!$C$5:$U$9,10,0)))","v":""},{"$f":"IF((C9=\"\"),(\"\"),(VLOOKUP(C9,ENTRADA!$C$5:$U$9,16,0)))","v":""},{"$f":"IF((C9=\"\"),(\"\"),(VLOOKUP(C9,ENTRADA!$C$5:$U$9,18,0)))","v":""},{"$f":"IF((C9=\"\"),(\"\"),(VLOOKUP(C9,ENTRADA!$C$5:$U$9,12,0)))","v":""},{"$f":"IF((C9=\"\"),(\"\"),(VLOOKUP(C9,ENTRADA!$C$5:$U$9,2,0)))","v":""},{"$f":"IF((C9=\"\"),(\"\"),(VLOOKUP(C9,ENTRADA!$C$5:$U$9,8,0)))","v":""},{"$f":"IF((C9=\"\"),(0),(F9+G9+1.5*H9+0.5*I9))","v":0},{"$f":"IF((C9=\"\"),(0),(J9+30*K9+0.5*L9))","v":0}]
[null,6,{"$f":"CONCATENATE((D10),(IF((D11=\"\"),(\"\"),(\" + \"))),D11,(IF((D12=\"\"),(\"\"),(\" + \"))),D12)","v":"1 + 2"},1,60,{"$f":"(IF((OR(($D10=\"\"),($D10=0))),(0),(($E10/100)*(VLOOKUP($D10,$B$5:$L$9,F$3,0)))))+(IF((OR(($D11=\"\"),($D11=0))),(0),(($E11/100)*(VLOOKUP($D11,$B$5:$L$9,F$3,0)))))+(IF((OR(($D12=\"\"),($D12=0))),(0),(($E12/100)*(VLOOKUP($D12,$B$5:$L$9,F$3,0)))))","v":13.123800000000001},{"$f":"(IF((OR(($D10=\"\"),($D10=0))),(0),(($E10/100)*(VLOOKUP($D10,$B$5:$L$9,G$3,0)))))+(IF((OR(($D11=\"\"),($D11=0))),(0),(($E11/100)*(VLOOKUP($D11,$B$5:$L$9,G$3,0)))))+(IF((OR(($D12=\"\"),($D12=0))),(0),(($E12/100)*(VLOOKUP($D12,$B$5:$L$9,G$3,0)))))","v":1.4838},0.8859999999999999,0.47399999999999998,5.5659999999999998,6.4199999999999993E-2,1.2238,{"$f":"IF((C10=\"\"),(0),(F10+G10+1.5*H10+0.5*I10))","v":16.1736},{"$f":"IF((C10=\"\"),(0),(J10+30*K10+0.5*L10))","v":8.1038999999999994}]
[null,null,null,2,40]
[null,null,null,null,{"$f":"100-(E10+E11)","v":0}]
[null,7,{"$f":"CONCATENATE((D13),(IF((D14=\"\"),(\"\"),(\" + \"))),D14,(IF((D15=\"\"),(\"\"),(\" + \"))),D15)","v":"6 + 3"},6,30,{"$f":"(IF((OR(($D13=\"\"),($D13=0))),(0),(($E13/100)*(VLOOKUP($D13,$B$5:$L$10,F$3,0)))))+(IF((OR(($D14=\"\"),($D14=0))),(0),(($E14/100)*(VLOOKUP($D14,$B$5:$L$10,F$3,0)))))+(IF((OR(($D15=\"\"),($D15=0))),(0),(($E15/100)*(VLOOKUP($D15,$B$5:$L$10,F$3,0)))))","v":17.23714},{"$f":"(IF((OR(($D13=\"\"),($D13=0))),(0),(($E13/100)*(VLOOKUP($D13,$B$5:$L$10,G$3,0)))))+(IF((OR(($D14=\"\"),($D14=0))),(0),(($E14/100)*(VLOOKUP($D14,$B$5:$L$10,G$3,0)))))+(IF((OR(($D15=\"\"),($D15=0))),(0),(($E15/100)*(VLOOKUP($D15,$B$5:$L$10,G$3,0)))))","v":1.2851399999999999},1.3157999999999999,0.70219999999999994,12.1698,7.5259999999999994E-2,{"$f":"(IF((OR(($D13=\"\"),($D13=0))),(0),(($E13/100)*(VLOOKUP($D13,$B$5:$L$10,L$3,0)))))+(IF((OR(($D14=\"\"),($D14=0))),(0),(($E14/100)*(VLOOKUP($D14,$B$5:$L$10,L$3,0)))))+(IF((OR(($D15=\"\"),($D15=0))),(0),(($E15/100)*(VLOOKUP($D15,$B$5:$L$10,L$3,0)))))","v":1.06714},{"$f":"IF((C13=\"\"),(0),(F13+G13+1.5*H13+0.5*I13))","v":20.847079999999998},{"$f":"J13+30*K13+0.5*L13","v":14.961169999999999}]
[null,null,null,3,70]
[null,null,null,null,{"$f":"100-(E13+E14)","v":0}]
[null,8,{"$f":"CONCATENATE((D16),(IF((D17=\"\"),(\"\"),(\" + \"))),D17,(IF((D18=\"\"),(\"\"),(\" + \"))),D18)","v":""},null,null,{"$f":"(IF((OR(($D16=\"\"),($D16=0))),(0),(($E16/100)*(VLOOKUP($D16,$B$5:$L$13,F$3,0)))))+(IF((OR(($D17=\"\"),($D17=0))),(0),(($E17/100)*(VLOOKUP($D17,$B$5:$L$13,F$3,0)))))+(IF((OR(($D18=\"\"),($D18=0))),(0),(($E18/100)*(VLOOKUP($D18,$B$5:$L$13,F$3,0)))))","v":0},{"$f":"(IF((OR(($D16=\"\"),($D16=0))),(0),(($E16/100)*(VLOOKUP($D16,$B$5:$L$13,G$3,0)))))+(IF((OR(($D17=\"\"),($D17=0))),(0),(($E17/100)*(VLOOKUP($D17,$B$5:$L$13,G$3,0)))))+(IF((OR(($D18=\"\"),($D18=0))),(0),(($E18/100)*(VLOOKUP($D18,$B$5:$L$13,G$3,0)))))","v":0},0,0,0,0,0,{"$f":"IF((C16=\"\"),(0),(F16+G16+1.5*H16+0.5*I16))","v":0},{"$f":"J16+30*K16+0.5*L16","v":0}]
[]
[null,null,null,null,{"$f":"100-(E16+E17)","v":100}]
[null,9,{"$f":"CONCATENATE((D19),(IF((D20=\"\"),(\"\"),(\" + \"))),D20,(IF((D21=\"\"),(\"\"),(\" + \"))),D21)","v":""},null,null,{"$f":"(IF((OR(($D19=\"\"),($D19=0))),(0),(($E19/100)*(VLOOKUP($D19,$B$5:$L$16,F$3,0)))))+(IF((OR(($D20=\"\"),($D20=0))),(0),(($E20/100)*(VLOOKUP($D20,$B$5:$L$16,F$3,0)))))+(IF((OR(($D21=\"\"),($D21=0))),(0),(($E21/100)*(VLOOKUP($D21,$B$5:$L$16,F$3,0)))))","v":0},{"$f":"(IF((OR(($D19=\"\"),($D19=0))),(0),(($E19/100)*(VLOOKUP($D19,$B$5:$L$16,G$3,0)))))+(IF((OR(($D20=\"\"),($D20=0))),(0),(($E20/100)*(VLOOKUP($D20,$B$5:$L$16,G$3,0)))))+(IF((OR(($D21=\"\"),($D21=0))),(0),(($E21/100)*(VLOOKUP($D21,$B$5:$L$16,G$3,0)))))","v":0},0,0,0,0,0,{"$f":"IF((C19=\"\"),(0),(F19+G19+1.5*H19+0.5*I19))","v":0},{"$f":"J19+30*K19+0.5*L19","v":0}]
[]
[null,null,null,null,{"$f":"100-(E19+E20)","v":100}]
[null,10,{"$f":"CONCATENATE((D22),(IF((D23=\"\"),(\"\"),(\" + \"))),D23,(IF((D24=\"\"),(\"\"),(\" + \"))),D24)","v":""},null,null,{"$f":"(IF((OR(($D22=\"\"),($D22=0))),(0),(($E22/100)*(VLOOKUP($D22,$B$5:$L$19,F$3,0)))))+(IF((OR(($D23=\"\"),($D23=0))),(0),(($E23/100)*(VLOOKUP($D23,$B$5:$L$19,F$3,0)))))+(IF((OR(($D24=\"\"),($D24=0))),(0),(($E24/100)*(VLOOKUP($D24,$B$5:$L$19,F$3,0)))))","v":0},{"$f":"(IF((OR(($D22=\"\"),($D22=0))),(0),(($E22/100)*(VLOOKUP($D22,$B$5:$L$19,G$3,0)))))+(IF((OR(($D23=\"\"),($D23=0))),(0),(($E23/100)*(VLOOKUP($D23,$B$5:$L$19,G$3,0)))))+(IF((OR(($D24=\"\"),($D24=0))),(0),(($E24/100)*(VLOOKUP($D24,$B$5:$L$19,G$3,0)))))","v":0},0,0,0,0,0,{"$f":"IF((C22=\"\"),(0),(F22+G22+1.5*H22+0.5*I22))","v":0},{"$f":"J22+30*K22+0.5*L22","v":0}]
[]
[null,null,null,null,{"$f":"100-(E22+E23)","v":100}]
[]
[]
[]
[]
[]
[]
[null,null,null,null,null,null,null,null,null,null,null,null,null,null,null,"* Nb, Ti, etc."]

{"sheet":"DELONG","index":4,"n_rows":31,"n_cols":17,"rows_kept":31,"cut":false,"hidden":false,"merged":[[9,8,11,8],[8,2,8,3],[3,2,3,3],[4,2,4,3],[5,2,5,3],[6,2,6,3],[7,2,7,3],[9,1,11,1],[9,2,11,2],[9,5,11,5],[9,6,11,6],[9,7,11,7],[12,1,14,1],[12,2,14,2],[12,5,14,5],[12,6,14,6],[12,7,14,7],[15,1,17,1],[15,2,17,2],[15,5,17,5],[15,6,17,6],[15,7,17,7],[18,1,20,1],[18,2,20,2],[18,5,20,5],[18,6,20,6],[18,7,20,7],[21,1,23,1],[21,2,23,2],[21,5,23,5],[21,6,23,6],[15,13,17,13],[21,7,23,7],[21,8,23,8],[18,8,20,8],[18,9,20,9],[18,10,20,10],[21,9,23,9],[21,10,23,10],[21,12,23,12],[21,13,23,13],[15,11,17,11],[18,11,20,11],[31,3,31,5],[15,14,17,14],[21,14,23,14],[21,11,23,11],[18,12,20,12],[15,8,17,8],[15,9,17,9],[15,10,17,10],[15,12,17,12],[1,7,1,8],[18,13,20,13],[18,14,20,14],[12,13,14,13],[12,14,14,14],[12,8,14,8],[12,9,14,9],[12,10,14,10],[12,12,14,12],[12,11,14,11],[9,9,11,9],[9,10,11,10],[9,12,11,12],[9,13,11,13],[9,14,11,14],[9,11,11,11]]}
[]
[null,"DIAGRAMA DE DELONG",null,null,null,null,null,"CAPA"]
[null,null,null,null,null,5,6,7,8,9,10,11,12]
[null,"Nº","ESPECIFICAÇÃO",null,"TEOR (%)","Cr","Mo","Si","*","Ni","C","N","Mn","Creq.","Nieq."]
[null,1,{"$f":"IF((SCHÄFFLER!C5=\"\"),(\"\"),(SCHÄFFLER!C5))","v":"AÇO ESTRUTURAL CASO HDT"},null,100,{"$f":"SCHÄFFLER!F5","v":5.8730000000000002},{"$f":"SCHÄFFLER!G5","v":1.9730000000000001},{"$f":"SCHÄFFLER!H5","v":1.1599999999999999},{"$f":"SCHÄFFLER!I5","v":0.79},{"$f":"SCHÄFFLER!J5","v":0.61},{"$f":"SCHÄFFLER!K5","v":8.6999999999999994E-2},{"$f":"IF((C5=\"\"),(\"\"),(VLOOKUP(C5,ENTRADA!$C$5:$U$9,14,0)))","v":1.2E-2},{"$f":"SCHÄFFLER!L5","v":0.873},{"$f":"IF((C5=\"\"),(0),(F5+G5+1.5*H5+0.5*I5))","v":9.9809999999999999},{"$f":"IF((C5=\"\"),(0),(J5+30*K5+30*L5+0.5*M5))","v":4.0164999999999997}]
[null,2,{"$f":"IF((SCHÄFFLER!C6=\"\"),(\"\"),(SCHÄFFLER!C6))","v":"AWS ER309L"},null,100,{"$f":"SCHÄFFLER!F6","v":24},{"$f":"SCHÄFFLER!G6","v":0.75},{"$f":"SCHÄFFLER!H6","v":0.47499999999999998},{"$f":"SCHÄFFLER!I6","v":0},{"$f":"SCHÄFFLER!J6","v":13},{"$f":"SCHÄFFLER!K6","v":0.03},{"$f":"IF((C6=\"\"),(\"\"),(VLOOKUP(C6,ENTRADA!$C$5:$U$9,14,0)))","v":0},{"$f":"SCHÄFFLER!L6","v":1.75},{"$f":"IF((C6=\"\"),(0),(F6+G6+1.5*H6+0.5*I6))","v":25.462499999999999},{"$f":"IF((C6=\"\"),(0),(J6+30*K6+30*L6+0.5*M6))","v":14.775}]
[null,3,{"$f":"IF((SCHÄFFLER!C7=\"\"),(\"\"),(SCHÄFFLER!C7))","v":"AWS ER347"},null,100,{"$f":"SCHÄFFLER!F7","v":19},{"$f":"SCHÄFFLER!G7","v":1.2},{"$f":"SCHÄFFLER!H7","v":1.5},{"$f":"SCHÄFFLER!I7","v":0.8},{"$f":"SCHÄFFLER!J7","v":15},{"$f":"SCHÄFFLER!K7","v":0.08},{"$f":"IF((C7=\"\"),(\"\"),(VLOOKUP(C7,ENTRADA!$C$5:$U$9,14,0)))","v":0.13},{"$f":"SCHÄFFLER!L7","v":1},22.849999999999998,21.799999999999997]
[null,4,{"$f":"IF((SCHÄFFLER!C8=\"\"),(\"\"),(SCHÄFFLER!C8))","v":""},null,100,{"$f":"SCHÄFFLER!F8","v":""},{"$f":"SCHÄFFLER!G8","v":""},{"$f":"SCHÄFFLER!H8","v":""},{"$f":"SCHÄFFLER!I8","v":""},{"$f":"SCHÄFFLER!J8","v":""},{"$f":"SCHÄFFLER!K8","v":""},{"$f":"IF((C8=\"\"),(\"\"),(VLOOKUP(C8,ENTRADA!$C$5:$U$9,14,0)))","v":""},{"$f":"SCHÄFFLER!L8","v":""},0,0]
[null,5,{"$f":"IF((SCHÄFFLER!C9=\"\"),(\"\"),(SCHÄFFLER!C9))","v":""},null,100,{"$f":"SCHÄFFLER!F9","v":""},{"$f":"SCHÄFFLER!G9","v":""},{"$f":"SCHÄFFLER!H9","v":""},{"$f":"SCHÄFFLER!I9","v":""},{"$f":"SCHÄFFLER!J9","v":""},{"$f":"SCHÄFFLER!K9","v":""},{"$f":"IF((C9=\"\"),(\"\"),(VLOOKUP(C9,ENTRADA!$C$5:$U$9,14,0)))","v":""},{"$f":"SCHÄFFLER!L9","v":""},0,0]
[null,6,{"$f":"CONCATENATE((D10),(IF((D11=\"\"),(\"\"),(\" + \"))),D11,(IF((D12=\"\"),(\"\"),(\" + \"))),D12)","v":"1 + 2"},1,60,{"$f":"(IF((OR(($D10=\"\"),($D10=0))),(0),(($E10/100)*(VLOOKUP($D10,$B$5:$M$9,F$3,0)))))+(IF((OR(($D11=\"\"),($D11=0))),(0),(($E11/100)*(VLOOKUP($D11,$B$5:$M$9,F$3,0)))))+(IF((OR(($D12=\"\"),($D12=0))),(0),(($E12/100)*(VLOOKUP($D12,$B$5:$M$9,F$3,0)))))","v":13.123800000000001},{"$f":"(IF((OR(($D10=\"\"),($D10=0))),(0),(($E10/100)*(VLOOKUP($D10,$B$5:$M$9,G$3,0)))))+(IF((OR(($D11=\"\"),($D11=0))),(0),(($E11/100)*(VLOOKUP($D11,$B$5:$M$9,G$3,0)))))+(IF((OR(($D12=\"\"),($D12=0))),(0),(($E12/100)*(VLOOKUP($D12,$B$5:$M$9,G$3,0)))))","v":1.4838},0.8859999999999999,0.47399999999999998,5.5659999999999998,6.4199999999999993E-2,{"$f":"(IF((OR(($D10=\"\"),($D10=0))),(0),(($E10/100)*(VLOOKUP($D10,$B$5:$M$9,L$3,0)))))+(IF((OR(($D11=\"\"),($D11=0))),(0),(($E11/100)*(VLOOKUP($D11,$B$5:$M$9,L$3,0)))))+(IF((OR(($D12=\"\"),($D12=0))),(0),(($E12/100)*(VLOOKUP($D12,$B$5:$M$9,L$3,0)))))","v":7.1999999999999998E-3},1.2238,{"$f":"IF((C10=\"\"),(0),(F10+G10+1.5*H10+0.5*I10))","v":16.1736},{"$f":"IF((C10=\"\"),(0),(J10+30*K10+30*L10+0.5*M10))","v":8.3198999999999987}]
[null,null,null,2,40]
[null,null,null,null,{"$f":"100-(E10+E11)","v":0}]
[null,7,{"$f":"CONCATENATE((D13),(IF((D14=\"\"),(\"\"),(\" + \"))),D14,(IF((D15=\"\"),(\"\"),(\" + \"))),D15)","v":"6 + 3"},6,30,{"$f":"(IF((OR(($D13=\"\"),($D13=0))),(0),(($E13/100)*(VLOOKUP($D13,$B$5:$M$10,F$3,0)))))+(IF((OR(($D14=\"\"),($D14=0))),(0),(($E14/100)*(VLOOKUP($D14,$B$5:$M$10,F$3,0)))))+(IF((OR(($D15=\"\"),($D15=0))),(0),(($E15/100)*(VLOOKUP($D15,$B$5:$M$10,F$3,0)))))","v":17.23714},{"$f":"(IF((OR(($D13=\"\"),($D13=0))),(0),(($E13/100)*(VLOOKUP($D13,$B$5:$M$10,G$3,0)))))+(IF((OR(($D14=\"\"),($D14=0))),(0),(($E14/100)*(VLOOKUP($D14,$B$5:$M$10,G$3,0)))))+(IF((OR(($D15=\"\"),($D15=0))),(0),(($E15/100)*(VLOOKUP($D15,$B$5:$M$10,G$3,0)))))","v":1.2851399999999999},1.3157999999999999,0.70219999999999994,12.1698,7.5259999999999994E-2,{"$f":"(IF((OR(($D13=\"\"),($D13=0))),(0),(($E13/100)*(VLOOKUP($D13,$B$5:$M$10,L$3,0)))))+(IF((OR(($D14=\"\"),($D14=0))),(0),(($E14/100)*(VLOOKUP($D14,$B$5:$M$10,L$3,0)))))+(IF((OR(($D15=\"\"),($D15=0))),(0),(($E15/100)*(VLOOKUP($D15,$B$5:$M$10,L$3,0)))))","v":9.3159999999999993E-2},1.06714,{"$f":"IF((C13=\"\"),(0),(F13+G13+1.5*H13+0.5*I13))","v":20.847079999999998},{"$f":"IF((C13=\"\"),(0),(J13+30*K13+30*L13+0.5*M13))","v":17.755970000000001}]
[null,null,null,3,70]
[null,null,null,null,{"$f":"100-(E13+E14)","v":0}]
[null,8,{"$f":"CONCATENATE((D16),(IF((D17=\"\"),(\"\"),(\" + \"))),D17,(IF((D18=\"\"),(\"\"),(\" + \"))),D18)","v":""},null,null,{"$f":"(IF((OR(($D16=\"\"),($D16=0))),(0),(($E16/100)*(VLOOKUP($D16,$B$5:$M$13,F$3,0)))))+(IF((OR(($D17=\"\"),($D17=0))),(0),(($E17/100)*(VLOOKUP($D17,$B$5:$M$13,F$3,0)))))+(IF((OR(($D18=\"\"),($D18=0))),(0),(($E18/100)*(VLOOKUP($D18,$B$5:$M$13,F$3,0)))))","v":0},{"$f":"(IF((OR(($D16=\"\"),($D16=0))),(0),(($E16/100)*(VLOOKUP($D16,$B$5:$M$13,G$3,0)))))+(IF((OR(($D17=\"\"),($D17=0))),(0),(($E17/100)*(VLOOKUP($D17,$B$5:$M$13,G$3,0)))))+(IF((OR(($D18=\"\"),($D18=0))),(0),(($E18/100)*(VLOOKUP($D18,$B$5:$M$13,G$3,0)))))","v":0},0,0,0,0,{"$f":"(IF((OR(($D16=\"\"),($D16=0))),(0),(($E16/100)*(VLOOKUP($D16,$B$5:$M$13,L$3,0)))))+(IF((OR(($D17=\"\"),($D17=0))),(0),(($E17/100)*(VLOOKUP($D17,$B$5:$M$13,L$3,0)))))+(IF((OR(($D18=\"\"),($D18=0))),(0),(($E18/100)*(VLOOKUP($D18,$B$5:$M$13,L$3,0)))))","v":0},0,{"$f":"IF((C16=\"\"),(0),(F16+G16+1.5*H16+0.5*I16))","v":0},{"$f":"IF((C16=\"\"),(0),(J16+30*K16+30*L16+0.5*M16))","v":0}]
[]
[null,null,null,null,{"$f":"100-(E16+E17)","v":100}]
[null,9,{"$f":"CONCATENATE((D19),(IF((D20=\"\"),(\"\"),(\" + \"))),D20,(IF((D21=\"\"),(\"\"),(\" + \"))),D21)","v":""},null,null,{"$f":"(IF((OR(($D19=\"\"),($D19=0))),(0),(($E19/100)*(VLOOKUP($D19,$B$5:$M$16,F$3,0)))))+(IF((OR(($D20=\"\"),($D20=0))),(0),(($E20/100)*(VLOOKUP($D20,$B$5:$M$16,F$3,0)))))+(IF((OR(($D21=\"\"),($D21=0))),(0),(($E21/100)*(VLOOKUP($D21,$B$5:$M$16,F$3,0)))))","v":0},{"$f":"(IF((OR(($D19=\"\"),($D19=0))),(0),(($E19/100)*(VLOOKUP($D19,$B$5:$M$16,G$3,0)))))+(IF((OR(($D20=\"\"),($D20=0))),(0),(($E20/100)*(VLOOKUP($D20,$B$5:$M$16,G$3,0)))))+(IF((OR(($D21=\"\"),($D21=0))),(0),(($E21/100)*(VLOOKUP($D21,$B$5:$M$16,G$3,0)))))","v":0},0,0,0,0,{"$f":"(IF((OR(($D19=\"\"),($D19=0))),(0),(($E19/100)*(VLOOKUP($D19,$B$5:$M$16,L$3,0)))))+(IF((OR(($D20=\"\"),($D20=0))),(0),(($E20/100)*(VLOOKUP($D20,$B$5:$M$16,L$3,0)))))+(IF((OR(($D21=\"\"),($D21=0))),(0),(($E21/100)*(VLOOKUP($D21,$B$5:$M$16,L$3,0)))))","v":0},0,{"$f":"IF((C19=\"\"),(0),(F19+G19+1.5*H19+0.5*I19))","v":0},{"$f":"IF((C19=\"\"),(0),(J19+30*K19+30*L19+0.5*M19))","v":0}]
[]
[null,null,null,null,{"$f":"100-(E19+E20)","v":100}]
[null,10,{"$f":"CONCATENATE((D22),(IF((D23=\"\"),(\"\"),(\" + \"))),D23,(IF((D24=\"\"),(\"\"),(\" + \"))),D24)","v":""},null,null,{"$f":"(IF((OR(($D22=\"\"),($D22=0))),(0),(($E22/100)*(VLOOKUP($D22,$B$5:$M$19,F$3,0)))))+(IF((OR(($D23=\"\"),($D23=0))),(0),(($E23/100)*(VLOOKUP($D23,$B$5:$M$19,F$3,0)))))+(IF((OR(($D24=\"\"),($D24=0))),(0),(($E24/100)*(VLOOKUP($D24,$B$5:$M$19,F$3,0)))))","v":0},{"$f":"(IF((OR(($D22=\"\"),($D22=0))),(0),(($E22/100)*(VLOOKUP($D22,$B$5:$M$19,G$3,0)))))+(IF((OR(($D23=\"\"),($D23=0))),(0),(($E23/100)*(VLOOKUP($D23,$B$5:$M$19,G$3,0)))))+(IF((OR(($D24=\"\"),($D24=0))),(0),(($E24/100)*(VLOOKUP($D24,$B$5:$M$19,G$3,0)))))","v":0},0,0,0,0,{"$f":"(IF((OR(($D22=\"\"),($D22=0))),(0),(($E22/100)*(VLOOKUP($D22,$B$5:$M$19,L$3,0)))))+(IF((OR(($D23=\"\"),($D23=0))),(0),(($E23/100)*(VLOOKUP($D23,$B$5:$M$19,L$3,0)))))+(IF((OR(($D24=\"\"),($D24=0))),(0),(($E24/100)*(VLOOKUP($D24,$B$5:$M$19,L$3,0)))))","v":0},0,{"$f":"IF((C22=\"\"),(0),(F22+G22+1.5*H22+0.5*I22))","v":0},{"$f":"IF((C22=\"\"),(0),(J22+30*K22+30*L22+0.5*M22))","v":0}]
[]
[null,null,null,null,{"$f":"100-(E22+E23)","v":100}]
[]
[]
[]
[]
[]
[]
[null,null,null,null,null,null,null,null,null,null,null,null,null,null,null,null,"* Nb, Ti, etc."]

{"sheet":"WRC","index":5,"n_rows":31,"n_cols":17,"rows_kept":31,"cut":false,"hidden":false,"merged":[[31,3,31,5],[21,8,23,8],[21,9,23,9],[21,10,23,10],[21,11,23,11],[21,12,23,12],[21,13,23,13],[21,1,23,1],[21,2,23,2],[21,5,23,5],[21,6,23,6],[21,7,23,7],[18,13,20,13],[18,1,20,1],[18,2,20,2],[18,5,20,5],[18,6,20,6],[18,7,20,7],[18,8,20,8],[18,9,20,9],[18,10,20,10],[18,11,20,11],[18,12,20,12],[15,13,17,13],[15,1,17,1],[15,2,17,2],[15,5,17,5],[15,6,17,6],[15,7,17,7],[15,8,17,8],[15,9,17,9],[15,10,17,10],[15,11,17,11],[15,12,17,12],[12,13,14,13],[12,1,14,1],[12,2,14,2],[12,5,14,5],[12,6,14,6],[12,7,14,7],[12,8,14,8],[12,9,14,9],[12,10,14,10],[12,11,14,11],[12,12,14,12],[9,13,11,13],[9,1,11,1],[9,2,11,2],[9,5,11,5],[9,6,11,6],[9,7,11,7],[9,8,11,8],[9,9,11,9],[9,10,11,10],[9,11,11,11],[9,12,11,12],[1,7,1,8],[8,2,8,3],[3,2,3,3],[4,2,4,3],[5,2,5,3],[6,2,6,3],[7,2,7,3]]}
[]
[null,"DIAGRAMA WRC",null,null,null,null,null,"CAPA"]
[null,null,null,null,null,5,6,7,8,9,10,11]
[null,"Nº","ESPECIFICAÇÃO",null,"TEOR (%)","Cr","Mo","*","Ni","C","N","Cu","Creq.","Nieq."]
[null,1,{"$f":"IF((SCHÄFFLER!C5=\"\"),(\"\"),(SCHÄFFLER!C5))","v":"AÇO ESTRUTURAL CASO HDT"},null,100,{"$f":"SCHÄFFLER!F5","v":5.8730000000000002},{"$f":"SCHÄFFLER!G5","v":1.9730000000000001},{"$f":"SCHÄFFLER!I5","v":0.79},{"$f":"SCHÄFFLER!J5","v":0.61},{"$f":"SCHÄFFLER!K5","v":8.6999999999999994E-2},{"$f":"DELONG!L5","v":1.2E-2},{"$f":"IF((C5=\"\"),(\"\"),(VLOOKUP(C5,ENTRADA!$C$5:$U$9,4,0)))","v":6.3E-2},{"$f":"IF((C5=\"\"),(0),(F5+G5+0.7*H5))","v":8.3990000000000009},{"$f":"IF((C5=\"\"),(0),(I5+35*J5+20*K5+0.25*L5))","v":3.9107499999999997}]
[null,2,{"$f":"IF((SCHÄFFLER!C6=\"\"),(\"\"),(SCHÄFFLER!C6))","v":"AWS ER309L"},null,100,{"$f":"SCHÄFFLER!F6","v":24},{"$f":"SCHÄFFLER!G6","v":0.75},{"$f":"SCHÄFFLER!I6","v":0},{"$f":"SCHÄFFLER!J6","v":13},{"$f":"SCHÄFFLER!K6","v":0.03},{"$f":"DELONG!L6","v":0},{"$f":"IF((C6=\"\"),(\"\"),(VLOOKUP(C6,ENTRADA!$C$5:$U$9,4,0)))","v":0.75},{"$f":"IF((C6=\"\"),(0),(F6+G6+0.7*H6))","v":24.75},{"$f":"IF((C6=\"\"),(0),(I6+35*J6+20*K6+0.25*L6))","v":14.237500000000001}]
[null,3,{"$f":"IF((SCHÄFFLER!C7=\"\"),(\"\"),(SCHÄFFLER!C7))","v":"AWS ER347"},null,100,{"$f":"SCHÄFFLER!F7","v":19},{"$f":"SCHÄFFLER!G7","v":1.2},{"$f":"SCHÄFFLER!I7","v":0.8},{"$f":"SCHÄFFLER!J7","v":15},{"$f":"SCHÄFFLER!K7","v":0.08},{"$f":"DELONG!L7","v":0.13},{"$f":"IF((C7=\"\"),(\"\"),(VLOOKUP(C7,ENTRADA!$C$5:$U$9,4,0)))","v":0},20.759999999999998,20.400000000000002]
[null,4,{"$f":"IF((SCHÄFFLER!C8=\"\"),(\"\"),(SCHÄFFLER!C8))","v":""},null,100,{"$f":"SCHÄFFLER!F8","v":""},{"$f":"SCHÄFFLER!G8","v":""},{"$f":"SCHÄFFLER!I8","v":""},{"$f":"SCHÄFFLER!J8","v":""},{"$f":"SCHÄFFLER!K8","v":""},{"$f":"DELONG!L8","v":""},{"$f":"IF((C8=\"\"),(\"\"),(VLOOKUP(C8,ENTRADA!$C$5:$U$9,4,0)))","v":""},0,0]
[null,5,{"$f":"IF((SCHÄFFLER!C9=\"\"),(\"\"),(SCHÄFFLER!C9))","v":""},null,100,{"$f":"SCHÄFFLER!F9","v":""},{"$f":"SCHÄFFLER!G9","v":""},{"$f":"SCHÄFFLER!I9","v":""},{"$f":"SCHÄFFLER!J9","v":""},{"$f":"SCHÄFFLER!K9","v":""},{"$f":"DELONG!L9","v":""},{"$f":"IF((C9=\"\"),(\"\"),(VLOOKUP(C9,ENTRADA!$C$5:$U$9,4,0)))","v":""},0,{"$f":"IF((C9=\"\"),(0),(I9+35*J9+20*K9+0.25*L9))","v":0}]
[null,6,{"$f":"CONCATENATE((D10),(IF((D11=\"\"),(\"\"),(\" + \"))),D11,(IF((D12=\"\"),(\"\"),(\" + \"))),D12)","v":"1 + 2"},1,60,{"$f":"(IF((OR(($D10=\"\"),($D10=0))),(0),(($E10/100)*(VLOOKUP($D10,$B$5:$L$9,F$3,0)))))+(IF((OR(($D11=\"\"),($D11=0))),(0),(($E11/100)*(VLOOKUP($D11,$B$5:$L$9,F$3,0)))))+(IF((OR(($D12=\"\"),($D12=0))),(0),(($E12/100)*(VLOOKUP($D12,$B$5:$L$9,F$3,0)))))","v":13.123800000000001},1.4838,0.47399999999999998,5.5659999999999998,6.4199999999999993E-2,7.1999999999999998E-3,0.33780000000000004,{"$f":"IF((C10=\"\"),(0),(F10+G10+0.7*H10))","v":14.939400000000001},{"$f":"IF((C10=\"\"),(0),(I10+35*J10+20*K10+0.25*L10))","v":8.0414499999999993}]
[null,null,null,2,40]
[null,null,null,null,{"$f":"100-(E10+E11)","v":0}]
[null,7,{"$f":"CONCATENATE((D13),(IF((D14=\"\"),(\"\"),(\" + \"))),D14,(IF((D15=\"\"),(\"\"),(\" + \"))),D15)","v":"6 + 3"},6,30,{"$f":"(IF((OR(($D13=\"\"),($D13=0))),(0),(($E13/100)*(VLOOKUP($D13,$B$5:$L$10,F$3,0)))))+(IF((OR(($D14=\"\"),($D14=0))),(0),(($E14/100)*(VLOOKUP($D14,$B$5:$L$10,F$3,0)))))+(IF((OR(($D15=\"\"),($D15=0))),(0),(($E15/100)*(VLOOKUP($D15,$B$5:$L$10,F$3,0)))))","v":17.23714},{"$f":"(IF((OR(($D13=\"\"),($D13=0))),(0),(($E13/100)*(VLOOKUP($D13,$B$5:$L$10,G$3,0)))))+(IF((OR(($D14=\"\"),($D14=0))),(0),(($E14/100)*(VLOOKUP($D14,$B$5:$L$10,G$3,0)))))+(IF((OR(($D15=\"\"),($D15=0))),(0),(($E15/100)*(VLOOKUP($D15,$B$5:$L$10,G$3,0)))))","v":1.2851399999999999},0.70219999999999994,12.1698,7.5259999999999994E-2,9.3159999999999993E-2,0.10134000000000001,{"$f":"IF((C13=\"\"),(0),(F13+G13+0.7*H13))","v":19.013819999999999},{"$f":"IF((C13=\"\"),(0),(I13+35*J13+20*K13+0.25*L13))","v":16.692435}]
[null,null,null,3,70]
[null,null,null,null,{"$f":"100-(E13+E14)","v":0}]
[null,8,{"$f":"CONCATENATE((D16),(IF((D17=\"\"),(\"\"),(\" + \"))),D17,(IF((D18=\"\"),(\"\"),(\" + \"))),D18)","v":""},null,null,{"$f":"(IF((OR(($D16=\"\"),($D16=0))),(0),(($E16/100)*(VLOOKUP($D16,$B$5:$L$13,F$3,0)))))+(IF((OR(($D17=\"\"),($D17=0))),(0),(($E17/100)*(VLOOKUP($D17,$B$5:$L$13,F$3,0)))))+(IF((OR(($D18=\"\"),($D18=0))),(0),(($E18/100)*(VLOOKUP($D18,$B$5:$L$13,F$3,0)))))","v":0},{"$f":"(IF((OR(($D16=\"\"),($D16=0))),(0),(($E16/100)*(VLOOKUP($D16,$B$5:$L$13,G$3,0)))))+(IF((OR(($D17=\"\"),($D17=0))),(0),(($E17/100)*(VLOOKUP($D17,$B$5:$L$13,G$3,0)))))+(IF((OR(($D18=\"\"),($D18=0))),(0),(($E18/100)*(VLOOKUP($D18,$B$5:$L$13,G$3,0)))))","v":0},0,0,0,0,0,{"$f":"IF((C16=\"\"),(0),(F16+G16+0.7*H16))","v":0},{"$f":"IF((C16=\"\"),(0),(I16+35*J16+20*K16+0.25*L16))","v":0}]
[]
[null,null,null,null,{"$f":"100-(E16+E17)","v":100}]
[null,9,{"$f":"CONCATENATE((D19),(IF((D20=\"\"),(\"\"),(\" + \"))),D20,(IF((D21=\"\"),(\"\"),(\" + \"))),D21)","v":""},null,null,{"$f":"(IF((OR(($D19=\"\"),($D19=0))),(0),(($E19/100)*(VLOOKUP($D19,$B$5:$L$16,F$3,0)))))+(IF((OR(($D20=\"\"),($D20=0))),(0),(($E20/100)*(VLOOKUP($D20,$B$5:$L$16,F$3,0)))))+(IF((OR(($D21=\"\"),($D21=0))),(0),(($E21/100)*(VLOOKUP($D21,$B$5:$L$16,F$3,0)))))","v":0},{"$f":"(IF((OR(($D19=\"\"),($D19=0))),(0),(($E19/100)*(VLOOKUP($D19,$B$5:$L$16,G$3,0)))))+(IF((OR(($D20=\"\"),($D20=0))),(0),(($E20/100)*(VLOOKUP($D20,$B$5:$L$16,G$3,0)))))+(IF((OR(($D21=\"\"),($D21=0))),(0),(($E21/100)*(VLOOKUP($D21,$B$5:$L$16,G$3,0)))))","v":0},0,0,0,0,0,{"$f":"IF((C19=\"\"),(0),(F19+G19+0.7*H19))","v":0},{"$f":"IF((C19=\"\"),(0),(I19+35*J19+20*K19+0.25*L19))","v":0}]
[]
[null,null,null,null,{"$f":"100-(E19+E20)","v":100}]
[null,10,{"$f":"CONCATENATE((D22),(IF((D23=\"\"),(\"\"),(\" + \"))),D23,(IF((D24=\"\"),(\"\"),(\" + \"))),D24)","v":""},null,null,{"$f":"(IF((OR(($D22=\"\"),($D22=0))),(0),(($E22/100)*(VLOOKUP($D22,$B$5:$L$19,F$3,0)))))+(IF((OR(($D23=\"\"),($D23=0))),(0),(($E23/100)*(VLOOKUP($D23,$B$5:$L$19,F$3,0)))))+(IF((OR(($D24=\"\"),($D24=0))),(0),(($E24/100)*(VLOOKUP($D24,$B$5:$L$19,F$3,0)))))","v":0},{"$f":"(IF((OR(($D22=\"\"),($D22=0))),(0),(($E22/100)*(VLOOKUP($D22,$B$5:$L$19,G$3,0)))))+(IF((OR(($D23=\"\"),($D23=0))),(0),(($E23/100)*(VLOOKUP($D23,$B$5:$L$19,G$3,0)))))+(IF((OR(($D24=\"\"),($D24=0))),(0),(($E24/100)*(VLOOKUP($D24,$B$5:$L$19,G$3,0)))))","v":0},0,0,0,0,0,{"$f":"IF((C22=\"\"),(0),(F22+G22+0.7*H22))","v":0},{"$f":"IF((C22=\"\"),(0),(I22+35*J22+20*K22+0.25*L22))","v":0}]
[]
[null,null,null,null,{"$f":"100-(E22+E23)","v":100}]
[]
[]
[]
[]
[]
[]
[null,null,null,null,null,null,null,null,null,null,null,null,null,null,null,null,"* Nb, Ti, etc."]

{"sheet":"BALMFORTH","index":6,"n_rows":31,"n_cols":17,"rows_kept":31,"cut":false,"hidden":false,"merged":[[31,3,31,5],[21,9,23,9],[21,10,23,10],[21,11,23,11],[18,9,20,9],[18,10,20,10],[18,11,20,11],[18,1,20,1],[18,2,20,2],[18,5,20,5],[18,6,20,6],[18,7,20,7],[21,13,23,13],[21,1,23,1],[21,2,23,2],[21,5,23,5],[21,6,23,6],[21,7,23,7],[21,8,23,8],[21,12,23,12],[18,12,20,12],[18,13,20,13],[12,8,14,8],[15,9,17,9],[15,10,17,10],[15,11,17,11],[15,12,17,12],[15,13,17,13],[15,8,17,8],[12,9,14,9],[12,10,14,10],[12,11,14,11],[12,12,14,12],[12,13,14,13],[18,8,20,8],[12,1,14,1],[12,2,14,2],[12,5,14,5],[12,6,14,6],[12,7,14,7],[15,1,17,1],[15,2,17,2],[15,5,17,5],[15,6,17,6],[15,7,17,7],[9,13,11,13],[9,1,11,1],[9,2,11,2],[9,5,11,5],[9,6,11,6],[9,7,11,7],[9,8,11,8],[9,9,11,9],[9,10,11,10],[9,11,11,11],[9,12,11,12],[1,7,1,8],[8,2,8,3],[3,2,3,3],[4,2,4,3],[5,2,5,3],[6,2,6,3],[7,2,7,3]]}
[]
[null,"DIAGRAMA DE BALMFORTH",null,null,null,null,null,"CAPA"]
[null,null,null,null,null,5,6,7,8,9,10,11]
[null,"Nº","ESPECIFICAÇÃO",null,"TEOR (%)","Cr","Mo","Si","*","Ni","C","N","Creq.","Nieq."]
[null,1,{"$f":"IF((SCHÄFFLER!C5=\"\"),(\"\"),(SCHÄFFLER!C5))","v":"AÇO ESTRUTURAL CASO HDT"},null,100,{"$f":"SCHÄFFLER!F5","v":5.8730000000000002},{"$f":"SCHÄFFLER!G5","v":1.9730000000000001},{"$f":"SCHÄFFLER!H5","v":1.1599999999999999},{"$f":"SCHÄFFLER!I5","v":0.79},{"$f":"SCHÄFFLER!J5","v":0.61},{"$f":"SCHÄFFLER!K5","v":8.6999999999999994E-2},{"$f":"DELONG!L5","v":1.2E-2},{"$f":"IF((C5=\"\"),(0),(F5+2*G5+1.5*H5+10*I5))","v":19.459000000000003},{"$f":"IF((C5=\"\"),(0),(J5+35*K5+20*L5))","v":3.8949999999999996}]
[null,2,{"$f":"IF((SCHÄFFLER!C6=\"\"),(\"\"),(SCHÄFFLER!C6))","v":"AWS ER309L"},null,100,{"$f":"SCHÄFFLER!F6","v":24},{"$f":"SCHÄFFLER!G6","v":0.75},{"$f":"SCHÄFFLER!H6","v":0.47499999999999998},{"$f":"SCHÄFFLER!I6","v":0},{"$f":"SCHÄFFLER!J6","v":13},{"$f":"SCHÄFFLER!K6","v":0.03},{"$f":"DELONG!L6","v":0},{"$f":"IF((C6=\"\"),(0),(F6+2*G6+1.5*H6+10*I6))","v":26.212499999999999},{"$f":"IF((C6=\"\"),(0),(J6+35*K6+20*L6))","v":14.05}]
[null,3,{"$f":"IF((SCHÄFFLER!C7=\"\"),(\"\"),(SCHÄFFLER!C7))","v":"AWS ER347"},null,100,{"$f":"SCHÄFFLER!F7","v":19},{"$f":"SCHÄFFLER!G7","v":1.2},{"$f":"SCHÄFFLER!H7","v":1.5},{"$f":"SCHÄFFLER!I7","v":0.8},{"$f":"SCHÄFFLER!J7","v":15},{"$f":"SCHÄFFLER!K7","v":0.08},{"$f":"DELONG!L7","v":0.13},31.65,20.400000000000002]
[null,4,{"$f":"IF((SCHÄFFLER!C8=\"\"),(\"\"),(SCHÄFFLER!C8))","v":""},null,100,{"$f":"SCHÄFFLER!F8","v":""},{"$f":"SCHÄFFLER!G8","v":""},{"$f":"SCHÄFFLER!H8","v":""},{"$f":"SCHÄFFLER!I8","v":""},{"$f":"SCHÄFFLER!J8","v":""},{"$f":"SCHÄFFLER!K8","v":""},{"$f":"DELONG!L8","v":""},0,0]
[null,5,{"$f":"IF((SCHÄFFLER!C9=\"\"),(\"\"),(SCHÄFFLER!C9))","v":""},null,100,{"$f":"SCHÄFFLER!F9","v":""},{"$f":"SCHÄFFLER!G9","v":""},{"$f":"SCHÄFFLER!H9","v":""},{"$f":"SCHÄFFLER!I9","v":""},{"$f":"SCHÄFFLER!J9","v":""},{"$f":"SCHÄFFLER!K9","v":""},{"$f":"DELONG!L9","v":""},0,0]
[null,6,{"$f":"CONCATENATE((D10),(IF((D11=\"\"),(\"\"),(\" + \"))),D11,(IF((D12=\"\"),(\"\"),(\" + \"))),D12)","v":"1 + 2"},1,60,{"$f":"(IF((OR(($D10=\"\"),($D10=0))),(0),(($E10/100)*(VLOOKUP($D10,$B$5:$L$9,F$3,0)))))+(IF((OR(($D11=\"\"),($D11=0))),(0),(($E11/100)*(VLOOKUP($D11,$B$5:$L$9,F$3,0)))))+(IF((OR(($D12=\"\"),($D12=0))),(0),(($E12/100)*(VLOOKUP($D12,$B$5:$L$9,F$3,0)))))","v":13.123800000000001},1.4838,0.8859999999999999,0.47399999999999998,5.5659999999999998,6.4199999999999993E-2,7.1999999999999998E-3,{"$f":"IF((C10=\"\"),(0),(F10+2*G10+1.5*H10+10*I10))","v":22.160400000000003},{"$f":"IF((C10=\"\"),(0),(J10+35*K10+20*L10))","v":7.9569999999999999}]
[null,null,null,2,40]
[null,null,null,null,{"$f":"100-(E10+E11)","v":0}]
[null,7,{"$f":"CONCATENATE((D13),(IF((D14=\"\"),(\"\"),(\" + \"))),D14,(IF((D15=\"\"),(\"\"),(\" + \"))),D15)","v":"6 + 3"},6,30,{"$f":"(IF((OR(($D13=\"\"),($D13=0))),(0),(($E13/100)*(VLOOKUP($D13,$B$5:$L$10,F$3,0)))))+(IF((OR(($D14=\"\"),($D14=0))),(0),(($E14/100)*(VLOOKUP($D14,$B$5:$L$10,F$3,0)))))+(IF((OR(($D15=\"\"),($D15=0))),(0),(($E15/100)*(VLOOKUP($D15,$B$5:$L$10,F$3,0)))))","v":17.23714},1.2851399999999999,1.3157999999999999,0.70219999999999994,12.1698,7.5259999999999994E-2,9.3159999999999993E-2,{"$f":"IF((C13=\"\"),(0),(F13+2*G13+1.5*H13+10*I13))","v":28.80312},{"$f":"IF((C13=\"\"),(0),(J13+35*K13+20*L13))","v":16.667100000000001}]
[null,null,null,3,70]
[null,null,null,null,{"$f":"100-(E13+E14)","v":0}]
[null,8,{"$f":"CONCATENATE((D16),(IF((D17=\"\"),(\"\"),(\" + \"))),D17,(IF((D18=\"\"),(\"\"),(\" + \"))),D18)","v":""},null,null,{"$f":"(IF((OR(($D16=\"\"),($D16=0))),(0),(($E16/100)*(VLOOKUP($D16,$B$5:$L$13,F$3,0)))))+(IF((OR(($D17=\"\"),($D17=0))),(0),(($E17/100)*(VLOOKUP($D17,$B$5:$L$13,F$3,0)))))+(IF((OR(($D18=\"\"),($D18=0))),(0),(($E18/100)*(VLOOKUP($D18,$B$5:$L$13,F$3,0)))))","v":0},0,0,0,0,0,0,{"$f":"IF((C16=\"\"),(0),(F16+2*G16+1.5*H16+10*I16))","v":0},{"$f":"IF((C16=\"\"),(0),(J16+35*K16+20*L16))","v":0}]
[]
[null,null,null,null,{"$f":"100-(E16+E17)","v":100}]
[null,9,{"$f":"CONCATENATE((D19),(IF((D20=\"\"),(\"\"),(\" + \"))),D20,(IF((D21=\"\"),(\"\"),(\" + \"))),D21)","v":""},null,null,{"$f":"(IF((OR(($D19=\"\"),($D19=0))),(0),(($E19/100)*(VLOOKUP($D19,$B$5:$L$16,F$3,0)))))+(IF((OR(($D20=\"\"),($D20=0))),(0),(($E20/100)*(VLOOKUP($D20,$B$5:$L$16,F$3,0)))))+(IF((OR(($D21=\"\"),($D21=0))),(0),(($E21/100)*(VLOOKUP($D21,$B$5:$L$16,F$3,0)))))","v":0},0,0,0,0,0,0,{"$f":"IF((C19=\"\"),(0),(F19+2*G19+1.5*H19+10*I19))","v":0},{"$f":"IF((C19=\"\"),(0),(J19+35*K19+20*L19))","v":0}]
[]
[null,null,null,null,{"$f":"100-(E19+E20)","v":100}]
[null,10,{"$f":"CONCATENATE((D22),(IF((D23=\"\"),(\"\"),(\" + \"))),D23,(IF((D24=\"\"),(\"\"),(\" + \"))),D24)","v":""},null,50,{"$f":"(IF((OR(($D22=\"\"),($D22=0))),(0),(($E22/100)*(VLOOKUP($D22,$B$5:$L$19,F$3,0)))))+(IF((OR(($D23=\"\"),($D23=0))),(0),(($E23/100)*(VLOOKUP($D23,$B$5:$L$19,F$3,0)))))+(IF((OR(($D24=\"\"),($D24=0))),(0),(($E24/100)*(VLOOKUP($D24,$B$5:$L$19,F$3,0)))))","v":0},0,0,0,0,0,0,{"$f":"IF((C22=\"\"),(0),(F22+2*G22+1.5*H22+10*I22))","v":0},{"$f":"IF((C22=\"\"),(0),(J22+35*K22+20*L22))","v":0}]
[null,null,null,null,50]
[null,null,null,null,{"$f":"100-(E22+E23)","v":0}]
[]
[]
[]
[]
[]
[]
[null,null,null,null,null,null,null,null,null,null,null,null,null,null,null,null,"* Nb, Ti, etc."]

{"sheet":"Plan2","index":7,"n_rows":35,"n_cols":13,"rows_kept":35,"cut":false,"hidden":true,"merged":[]}
[]
[null,"X","L1","L2","L3","L4","L5"]
[null,0,{"$f":"(-0.8057*(0))+25.4","v":25.4},null,{"$f":"(-3.0435*(0))+7","v":7},{"$f":"(-0.7724*(0))+19","v":19}]
[null,2.2999999999999998,null,null,{"$f":"(-3.0435*(2.3))+7","v":-4.9999999998995293E-5}]
[null,7.6,null,{"$f":"(1.0895*(7.6))-7.7658","v":0.5143999999999993}]
[null,12.5,null,null,null,null,{"$f":"(0.3273*(12.5))-4.0909","v":3.499999999991843E-4}]
[null,14.5]
[null,22,null,null,null,{"$f":"(-0.7724*(22))+19","v":2.007200000000001}]
[null,26,{"$f":"(-0.8057*(26))+25.4","v":4.4517999999999986}]
[null,36.5,null,{"$f":"(1.0895*(36.5))-7.7658","v":32.000949999999996}]
[null,40,null,null,null,null,{"$f":"(0.3273*(40))-4.0909","v":9.0010999999999974}]
[]
[null,"X","L1","L2","L3","L4","L5","L6","L7","L8","L9","L10","L11"]
[null,16,15.5]
[null,21.5,10]
[null,16,null,10]
[null,23.75,null,21]
[null,16.600000000000001,null,null,10]
[null,25,null,null,21]
[null,17.2,null,null,null,10]
[null,25,null,null,null,20.2]
[null,17.7,null,null,null,null,10]
[null,25,null,null,null,null,19.3]
[null,18.100000000000001,null,null,null,null,null,10]
[null,25,null,null,null,null,null,18.7]
[null,18.5,null,null,null,null,null,null,10]
[null,25,null,null,null,null,null,null,18]
[null,18.899999999999999,null,null,null,null,null,null,null,10]
[null,25,null,null,null,null,null,null,null,17.3]
[null,19.3,null,null,null,null,null,null,null,null,10]
[null,25,null,null,null,null,null,null,null,null,16.600000000000001]
[null,19.75,null,null,null,null,null,null,null,null,null,10]
[null,25,null,null,null,null,null,null,null,null,null,16]
[null,20.2,null,null,null,null,null,null,null,null,null,null,10]
[null,25,null,null,null,null,null,null,null,null,null,null,15.3]

{"sheet":"MATERIAIS","index":8,"n_rows":81,"n_cols":12,"rows_kept":81,"cut":false,"hidden":false,"merged":[]}
[]
[null,"MATERIAIS DE SOLDA MAIS COMUNS",null,null,"CAPA"]
[]
[null,"ESPECIFICAÇÃO","TIPO","Carbono (C)","Cobre (Cu)","Cromo (Cr)","Manganês (Mn)","Molibdênio (Mo)","Níquel (Ni)","Nitrogênio (N)","Silício (Si)","Outros (Nb, Ti, Al, etc.)"]
[null,"11Cr 2.5Ni","SM",1.0999999999999999E-2,0.48,10.6,1.77,0.06,2.4,6.0000000000000001E-3,0.1,2.4060000000000001]
[null,"12Cr 4.5Ni 1.5Mo","SM",1.7000000000000001E-2,0.51,11.7,1.77,1.39,4.9000000000000004,1.0999999999999999E-2,0.2,4.907]
[null,"12Cr 6.5Ni 2.5Mo","SM",1.7999999999999999E-2,0.49,12.6,1.72,2.3199999999999998,6.5,1.0999999999999999E-2,0.09,6.508]
[null,"AISI 444","F",0.02,0,18,1,2.1,1,0.03,1,0.6]
[null,"ER 317","SF",0.06,0.75,19,1.8,3.5,14,0,0.45,0.6]
[null,"AISI 405","F",0.08,0,12.5,1,0,0,0,1,0.2]
[null,"AISI 409","F",0.08,0,11.2,1,0,0.5,0,1,0.5]
[null,"AISI 430","F",0.12,0,17,1,0,0,0,1,0]
[null,"AISI 430Ti","F",0.12,0,17,1,0,0,0,1,0.5]
[null,"AISI 430Nb","F",0.12,0,17,1,0,0,0,1,0.5]
[null,"AISI 442","F",0.2,0,21.5,1,0,1,0,1,1]
[null,"AISI 446","F",0.25,0,25,1,0,0,0,1,0]
[null,"AISI 410","M",0.15,0,12.5,1,0,0,0,1,0]
[null,"AISI 420","M",0.15,0,13,1,0,0,0,1,0]
[null,"AISI 440A","M",0.68,0,17,1,0.75,0,0,1,0]
[null,"AISI 440B","M",0.85,0,17,1,0.75,0,0,1,0]
[null,"AISI 440C","M",1.08,0,17,1,0.75,0,0,1,0]
[null,"AISI 431","M",0.2,0,16,1,0,0.19,0,1,0]
[null,"AISI 201","A",0.15,0,17,6.5,0,4.5,0.25,1,0]
[null,"AISI 301","A",0.15,0,17,2,0,7,0,1,0]
[null,"AISI 302","A",0.15,0,18,2,0,9,0,1,0]
[null,"AISI 304","A",0.08,0,19,2,0,9.3000000000000007,0,1,0]
[null,"AISI 304L","A",0.03,0,19,2,0,9.5,0,1,0]
[null,"AISI 304N","A",0.08,0,19,2,0,9.3000000000000007,0.23,1,0]
[null,"AISI 316","A",0.08,0,17,2,2.5,12,0,1,0]
[null,"AISI 316L","A",0.03,0,17,2,2.5,12,0,1,0]
[null,"AISI 317","A",0.08,0,19,2,3.5,13,0,1,0]
[null,"AISI 321","A",0.08,0,18,2,0,10.5,0,1,0.4]
[null,"AISI 347","A",0.08,0,18,2,0,11,0,1,0.8]
[null,"AISI 310","A",0.25,0,25,2,0,20.5,0,1.5,0]
[null,"AISI 310S","A",0.08,0,25,2,0,20.5,0,1.5,0]
[null,"SAF 2304 (UNS S32304 / UR35N)","D",0,0,23,0,0.2,4,0.1,0,0]
[null,"3RE60 (UNS S31500)","D",0,0,18.5,0,2.7,5,7.0000000000000007E-2,1.5,0]
[null,"SAF 2205 (UNS S31803 / UR45)","D",0,0,22,0,3,5.3,0.17,0,0]
[null,"10RE51 (UNS 32900)","D",0,0,25,0,1.5,4.5,0,0,0]
[null,"DP3 (UNS 31260)","D",0,0.5,25,0,3,6.5,0.16,0,0.3]
[null,"FERRALIUM 255 (UNS S32550 / UR52N)","D",0,1.6,25,0,3,6.5,0.18,0,0]
[null,"UR47N (UNS S32200)","D",0,0,25,0,3,6.5,0.18,0,0]
[null,"ZERON 100 (UNS S32700)","SD",0,0.7,25,0,3.6,7,0.25,0,0.7]
[null,"UR52N+","SD",0,1.5,25,0,3.8,6,0.25,0,0]
[null,"SAF 2507 (UNS S32750)","SD",0,0,25,0,3.8,7,0.27,0,0]
[null,"A-286","EP",0.05,0,15,0,1.2,26,0,0,2.4500000000000002]
[null,"AISI W","EP",7.0000000000000007E-2,0,16.75,0.5,0,6.75,0,0.5,1]
[null,"AISI 17-4 PH","EP",0.04,3.6,15.5,0.4,0,4.25,0,0.5,0.25]
[null,"AISI 17-7 PH","EP",7.0000000000000007E-2,0,17,0.7,0,7,0,0.4,1.1499999999999999]
[null,"AISI PH 15-7 Mo","EP",7.0000000000000007E-2,0,15,0.7,2.25,7,0,0.4,1.1499999999999999]
[null,"AISI AM 350","EP",0.1,0,16.5,0.75,2.25,4.25,0.1,0.35,0]
[null,"AISI 15-7 PH","EP",7.0000000000000007E-2,0,17,0.5,2.5,7,0,0.2,1.2]
[null,"AISI PH 14-8 Mo","EP",0.04,0,15.1,0.02,2.2000000000000002,8.1999999999999993,0,0.02,1.2]
[null,"AISI AM 355","EP",0.13,0,15.5,0.85,2.75,4.25,0.1,0.35,0]
[null,"AISI 15-5 PH","EP",0.04,3.4,15,0.3,2.5,4.2,0,0.4,0.25]
[null,"SAE 4340","BL",0.4,0,1.85,0.4,0.25,0.8,0,0.03,0]
[null,"AWS E308L","EA",0.03,0.5,19.5,1.5,0.5,10.5,0,0.9,0]
[null,"AWS E309L","EA",0.03,0.5,23.5,1.5,0.5,13,0,0.9,0]
[null,"AWS E309MoL","EA",0.03,0.5,23.5,1.5,2.5,13,0,0.9,0]
[null,"AWS E312","EA",0.15,0.5,30,1.5,0.5,9.25,0,0.9,0]
[null,"AWS E307","EA",0.13,0.5,19.3,4.0250000000000004,1,9.75,0,0.9,0]
[null,"AWS E308","EA",0.08,0.5,19.5,1.5,0.5,10,0,0.9,0]
[null,"AWS E308MoL","EA",0.03,0.5,19.5,1.5,2.5,10.5,0,0.9,0]
[null,"AWS E309","EA",0.15,0.5,23.5,1.5,0.5,13,0,0.9,0]
[null,"AWS E310","EA",0.2,0.5,26.5,1.75,0.5,21.75,0,0.75,0]
[null,"AWS E316","EA",0.08,0.5,18.5,1.5,2.25,12.5,0,0.9,0]
[null,"AWS ER308","EA",0.08,0.75,20.75,1.75,0.75,10,0,0.47499999999999998,0]
[null,"AWS ER308H","EA",0.06,0.75,20.75,1.75,0.5,10,0,0.47499999999999998,0]
[null,"AWS ER308L","EA",0.03,0.75,20.75,1.75,0.75,10,0,0.47499999999999998,0]
[null,"AWS ER308Mo","EA",0.08,0.75,19.5,1.75,2.5,10.5,0,0.47499999999999998,0]
[null,"AWS ER308Si","EA",0.08,0.75,20.75,1.75,0.75,10,0,0.47499999999999998,0]
[null,"AWS ER309","EA",0.12,0.75,24,1.75,0.75,13,0,0.47499999999999998,0]
[null,"AWS ER309L","EA",0.03,0.75,24,1.75,0.75,13,0,0.47499999999999998,0]
[null,"AWS ER310","EA",0.115,0.75,26.5,1.75,0.75,21.25,0,0.47499999999999998,0]
[null,"AWS ER312","EA",0.15,0.75,30,1.75,0.75,9.25,0,0.47499999999999998,0]
[null,"AWS ER316","EA",0.08,0.75,19,1.75,2.5,12.5,0,0.47499999999999998,0]
[null,"AWS ER317","EA",0.08,0.75,19.5,1.75,3.5,14,0,0.47499999999999998,0]
[null,"AÇO ESTRUTURAL CASO HDT","BL",8.6999999999999994E-2,6.3E-2,5.8730000000000002,0.873,1.9730000000000001,0.61,1.2E-2,1.1599999999999999,0.79]
[null,"AWS ER347","EA",0.08,0,19,1,1.2,15,0.13,1.5,0.8]
[null,"INCONEL 625","LE",0.1,0,21.5,0.5,9,57.45,0,0.5,4.55]
[null,"AWS E309MoL-16","EA",0.03,0,23,0,2.5,13,0,0,0]