{"text_format":"1","workbook":"xlsx","n_sheets":9,"sheets":["CAPA","GLOSSÁRIO","ENTRADA","SCHÄFFLER","DELONG","WRC","BALMFORTH","Plan2","MATERIAIS"],"not_rendered":{"charts":7,"images":22,"macros":1,"external_links":0,"defined_names":10,"comments":1,"pivot_tables":0},"unopened":[],"bounds":{"document_bytes":16777216,"sheet_cells":100000,"rows_first":2000,"rows_last":500,"rows_between":2000,"halvings":0,"cell_chars":16384,"cell_head_chars":4096},"cells_cut":0,"cells_raw":0,"read":"whole","date_system":"1900"}

{"sheet":"CAPA","index":0,"n_rows":2,"n_cols":15,"rows_kept":2,"cut":false,"hidden":false,"merged":[]}
[]
[" ",null,"GLOSSÁRIO",null,"ENTRADA",null,"SCHÄFFLER",null,"DELONG",null,"WRC",null,"BALMFORTH",null,"MATERIAIS"]

{"sheet":"GLOSSÁRIO","index":1,"n_rows":188,"n_cols":4,"rows_kept":188,"cut":false,"hidden":false,"merged":[]}
[]
[null,"SOLDINOX®",null,"CAPA"]
[]
[]
[null,"O SOLDINOX® é uma ferramenta matemática de simulação de soldas em ligas ferrosas em geral. Seu objetivo é prever a microestrutura final da poça de fusão, bem como "]
["estimar a dimensão e características da ZTA (zona termicamente afetada)."]
[]
[null,"Com base em diversos estudos, a microestrutura final é dependente do teor dos elementos de liga envolvidos. Observou-se empiricamente que o níquel induz à solidificação"]
["na forma austenítica (CFC), enquanto que o cromo favorece a ferrita (CCC). Notou-se, também, que os demais elementos de liga mais comuns tendem a se enquadrar nestas duas"]
["formas de estrutura final, favorecendo uma ou outra microestrutura, em maior ou menor grau. Com base nisso, se tornou possível correlacionar a composição química do metal "]
{"$rows_left_out":179}
{"sheet":"ENTRADA","index":2,"n_rows":21,"n_cols":20,"rows_kept":21,"cut":false,"hidden":false,"merged":[[14,3,14,4],[14,5,14,6],[14,7,14,8],[14,9,14,10],[20,15,20,16],[20,17,20,18],[20,19,20,20],[19,11,19,12],[19,13,19,14],[19,15,19,16],[19,17,19,18],[19,19,19,20],[18,15,18,16],[18,17,18,18],[18,19,18,20],[18,11,18,12],[18,13,18,14],[20,11,20,12],[20,13,20,14],[14,19,14,20],[15,19,15,20],[16,19,16,20],[17,11,17,12],[17,13,17,14],[17,15,17,16],[17,17,17,18],[17,19,17,20],[14,15,14,16],[15,15,15,16],[16,15,16,16],[14,17,14,18],[15,17,15,18],[16,17,16,18],[14,11,14,12],[15,11,15,12],[16,11,16,12],[14,13,14,14],[15,13,15,14],[16,13,16,14],[19,7,19,8],[20,7,20,8],[15,9,15,10],[16,9,16,10],[17,9,17,10],[18,9,18,10],[19,9,19,10],[20,9,20,10],[15,7,15,8],[16,7,16,8],[17,7,17,8],[18,7,18,8],[19,3,19,4],[20,3,20,4],[15,5,15,6],[16,5,16,6],[17,5,17,6],[18,5,18,6],[19,5,19,6],[20,5,20,6],[15,3,15,4],[16,3,16,4],[17,3,17,4],[18,3,18,4],[9,19,9,20],[10,19,10,20],[11,19,11,20],[13,1,13,14],[9,11,9,12],[10,11,10,12],[11,11,11,12],[9,13,9,18],[10,13,10,18],[11,13,11,18],[9,3,9,4],[10,3,10,4],[11,3,11,4],[12,3,12,4],[9,5,9,10],[10,5,10,10],[11,5,11,10],[6,17,6,18],[3,7,3,8],[4,7,4,8],[5,7,5,8],[6,7,6,8],[7,7,7,8],[3,9,3,10],[4,9,4,10],[5,9,5,10],[6,9,6,10],[7,9,7,10],[6,19,6,20],[4,15,4,16],[4,17,4,18],[4,19,4,20],[5,17,5,18],[5,19,5,20],[6,5,6,6],[8,3,8,4],[8,5,8,6],[8,11,8,12],[8,13,8,14],[8,15,8,16],[8,17,8,18],[8,19,8,20],[7,3,7,4],[7,5,7,6],[7,11,7,12],[7,13,7,14],[7,15,7,16],[7,17,7,18],[8,7,8,8],[8,9,8,10],[6,13,6,14],[6,15,6,16],[1,3,1,4],[9,1,12,1],[2,3,2,20],[13,15,13,16],[3,1,8,1],[4,3,4,4],[4,5,4,6],[4,11,4,12],[4,13,4,14],[6,3,6,4],[3,3,3,4],[3,5,3,6],[3,11,3,12],[3,13,3,14],[3,15,3,16],[3,17,3,18],[6,11,6,12],[5,3,5,4],[5,5,5,6],[5,11,5,12],[5,13,5,14],[5,15,5,16],[7,19,7,20],[3,19,3,20]]}
[]
[null,null,null,"CAPA"]
[null,null,null,"COMPOSIÇÃO QUÍMICA MÉDIA (%)"]
[null,"MATERIAIS E CONSUMÍVEIS","ESPECIFICAÇÃO","Carbono (C)",null,"Cobre (Cu)",null,"Cromo (Cr)",null,"Manganês (Mn)",null,"Molibdênio (Mo)",null,"Níquel (Ni)",null,"Nitrogênio (N)",null,"Silício (Si)",null,"Outros*"]
[null,null,"AÇO ESTRUTURAL CASO HDT",8.6999999999999994E-2,null,6.3E-2,null,5.8730000000000002,null,0.873,null,1.9730000000000001,null,0.61,null,1.2E-2,null,1.1599999999999999,null,0.79]
[null,null,"AWS ER309L",0.03,null,0.75,null,24,null,1.75,null,0.75,null,13,null,0,null,0.47499999999999998,null,0]
[null,null,"AWS ER347",0.08,null,0,null,19,null,1,null,1.2,null,15,null,0.13,null,1.5,null,0.8]
[null,null,null,"",null,"",null,"",null,"",null,"",null,"",null,"",null,"",null,""]
[null,null,null,"",null,"",null,"",null,"",null,"",null,"",null,"",null,"",null,""]
[null,"PARÂMETROS DE SOLDAGEM","Temperatura inicial da chapa (ºC):",35,null,"Eficiência de transferência de calor:",null,null,null,null,null,1,null,"Velocidade de soldagem (mm/s):",null,null,null,null,null,10]
{"$rows_left_out":12}
{"sheet":"SCHÄFFLER","index":3,"n_rows":31,"n_cols":16,"rows_kept":31,"cut":false,"hidden":false,"merged":[[21,1,23,1],[9,2,11,2],[12,2,14,2],[15,2,17,2],[18,2,20,2],[21,2,23,2],[15,1,17,1],[9,1,11,1],[15,5,17,5],[15,6,17,6],[15,7,17,7],[15,8,17,8],[18,1,20,1],[18,5,20,5],[18,6,20,6],[18,7,20,7],[18,8,20,8],[9,9,11,9],[9,10,11,10],[9,11,11,11],[12,1,14,1],[12,5,14,5],[12,6,14,6],[12,7,14,7],[12,8,14,8],[3,2,3,3],[4,2,4,3],[5,2,5,3],[6,2,6,3],[7,2,7,3],[8,2,8,3],[9,6,11,6],[21,10,23,10],[21,11,23,11],[21,12,23,12],[9,7,11,7],[9,8,11,8],[15,9,17,9],[15,10,17,10],[15,11,17,11],[15,12,17,12],[9,12,11,12],[12,9,14,9],[12,10,14,10],[12,11,14,11],[12,12,14,12],[1,7,1,8],[21,13,23,13],[21,5,23,5],[21,6,23,6],[21,7,23,7],[21,8,23,8],[21,9,23,9],[9,13,11,13],[12,13,14,13],[15,13,17,13],[18,9,20,9],[18,10,20,10],[18,11,20,11],[18,12,20,12],[18,13,20,13],[9,5,11,5]]}
[]
[null,"DIAGRAMA DE SCHÄFFLER",null,null,null,null,null,"CAPA"]
[null,null,null,null,null,5,6,7,8,9,10,11]
[null,"Nº","ESPECIFICAÇÃO",null,"TEOR (%)","Cr","Mo","Si","*","Ni","C","Mn","Creq.","Nieq."]
[null,1,"AÇO ESTRUTURAL CASO HDT",null,100,{"$f":"IF((C5=\"\"),(\"\"),(VLOOKUP(C5,ENTRADA!$C$5:$U$9,6,0)))","v":5.8730000000000002},{"$f":"IF((C5=\"\"),(\"\"),(VLOOKUP(C5,ENTRADA!$C$5:$U$9,10,0)))","v":1.9730000000000001},{"$f":"IF((C5=\"\"),(\"\"),(VLOOKUP(C5,ENTRADA!$C$5:$U$9,16,0)))","v":1.1599999999999999},{"$f":"IF((C5=\"\"),(\"\"),(VLOOKUP(C5,ENTRADA!$C$5:$U$9,18,0)))","v":0.79},{"$f":"IF((C5=\"\"),(\"\"),(VLOOKUP(C5,ENTRADA!$C$5:$U$9,12,0)))","v":0.61},{"$f":"IF((C5=\"\"),(\"\"),(VLOOKUP(C5,ENTRADA!$C$5:$U$9,2,0)))","v":8.6999999999999994E-2},{"$f":"IF((C5=\"\"),(\"\"),(VLOOKUP(C5,ENTRADA!$C$5:$U$9,8,0)))","v":0.873},{"$f":"IF((C5=\"\"),(0),(F5+G5+1.5*H5+0.5*I5))","v":9.9809999999999999},{"$f":"IF((C5=\"\"),(0),(J5+30*K5+0.5*L5))","v":3.6564999999999999}]
[null,2,"AWS ER309L",null,100,{"$f":"IF((C6=\"\"),(\"\"),(VLOOKUP(C6,ENTRADA!$C$5:$U$9,6,0)))","v":24},{"$f":"IF((C6=\"\"),(\"\"),(VLOOKUP(C6,ENTRADA!$C$5:$U$9,10,0)))","v":0.75},{"$f":"IF((C6=\"\"),(\"\"),(VLOOKUP(C6,ENTRADA!$C$5:$U$9,16,0)))","v":0.47499999999999998},{"$f":"IF((C6=\"\"),(\"\"),(VLOOKUP(C6,ENTRADA!$C$5:$U$9,18,0)))","v":0},{"$f":"IF((C6=\"\"),(\"\"),(VLOOKUP(C6,ENTRADA!$C$5:$U$9,12,0)))","v":13},{"$f":"IF((C6=\"\"),(\"\"),(VLOOKUP(C6,ENTRADA!$C$5:$U$9,2,0)))","v":0.03},{"$f":"IF((C6=\"\"),(\"\"),(VLOOKUP(C6,ENTRADA!$C$5:$U$9,8,0)))","v":1.75},25.462499999999999,14.775]
[null,3,"AWS ER347",null,100,{"$f":"IF((C7=\"\"),(\"\"),(VLOOKUP(C7,ENTRADA!$C$5:$U$9,6,0)))","v":19},{"$f":"IF((C7=\"\"),(\"\"),(VLOOKUP(C7,ENTRADA!$C$5:$U$9,10,0)))","v":1.2},{"$f":"IF((C7=\"\"),(\"\"),(VLOOKUP(C7,ENTRADA!$C$5:$U$9,16,0)))","v":1.5},{"$f":"IF((C7=\"\"),(\"\"),(VLOOKUP(C7,ENTRADA!$C$5:$U$9,18,0)))","v":0.8},{"$f":"IF((C7=\"\"),(\"\"),(VLOOKUP(C7,ENTRADA!$C$5:$U$9,12,0)))","v":15},{"$f":"IF((C7=\"\"),(\"\"),(VLOOKUP(C7,ENTRADA!$C$5:$U$9,2,0)))","v":0.08},{"$f":"IF((C7=\"\"),(\"\"),(VLOOKUP(C7,ENTRADA!$C$5:$U$9,8,0)))","v":1},22.849999999999998,17.899999999999999]
[null,4,null,null,100,{"$f":"IF((C8=\"\"),(\"\"),(VLOOKUP(C8,ENTRADA!$C$5:$U$9,6,0)))","v":""},{"$f":"IF((C8=\"\"),(\"\"),(VLOOKUP(C8,ENTRADA!$C$5:$U$9,10,0)))","v":""},{"$f":"IF((C8=\"\"),(\"\"),(VLOOKUP(C8,ENTRADA!$C$5:$U$9,16,0)))","v":""},{"$f":"IF((C8=\"\"),(\"\"),(VLOOKUP(C8,ENTRADA!$C$5:$U$9,18,0)))","v":""},{"$f":"IF((C8=\"\"),(\"\"),(VLOOKUP(C8,ENTRADA!$C$5:$U$9,12,0)))","v":""},{"$f":"IF((C8=\"\"),(\"\"),(VLOOKUP(C8,ENTRADA!$C$5:$U$9,2,0)))","v":""},{"$f":"IF((C8=\"\"),(\"\"),(VLOOKUP(C8,ENTRADA!$C$5:$U$9,8,0)))","v":""},{"$f":"IF((C8=\"\"),(0),(F8+G8+1.5*H8+0.5*I8))","v":0},{"$f":"IF((C8=\"\"),(0),(J8+30*K8+0.5*L8))","v":0}]
[null,5,null,null,100,{"$f":"IF((C9=\"\"),(\"\"),(VLOOKUP(C9,ENTRADA!$C$5:$U$9,6,0)))","v":""},{"$f":"IF((C9=\"\"),(\"\"),(VLOOKUP(C9,ENTRADA!$C$5:$U$9,10,0)))","v":""},{"$f":"IF((C9=\"\"),(\"\"),(VLOOKUP(C9,ENTRADA!$C$5:$U$9,16,0)))","v":""},{"$f":"IF((C9=\"\"),(\"\"),(VLOOKUP(C9,ENTRADA!$C$5:$U$9,18,0)))","v":""},{"$f":"IF((C9=\"\"),(\"\"),(VLOOKUP(C9,ENTRADA!$C$5:$U$9,12,0)))","v":""},{"$f":"IF((C9=\"\"),(\"\"),(VLOOKUP(C9,ENTRADA!$C$5:$U$9,2,0)))","v":""},{"$f":"IF((C9=\"\"),(\"\"),(VLOOKUP(C9,ENTRADA!$C$5:$U$9,8,0)))","v":""},{"$f":"IF((C9=\"\"),(0),(F9+G9+1.5*H9+0.5*I9))","v":0},{"$f":"IF((C9=\"\"),(0),(J9+30*K9+0.5*L9))","v":0}]
[null,6,{"$f":"CONCATENATE((D10),(IF((D11=\"\"),(\"\"),(\" + \"))),D11,(IF((D12=\"\"),(\"\"),(\" + \"))),D12)","v":"1 + 2"},1,60,{"$f":"(IF((OR(($D10=\"\"),($D10=0))),(0),(($E10/100)*(VLOOKUP($D10,$B$5:$L$9,F$3,0)))))+(IF((OR(($D11=\"\"),($D11=0))),(0),(($E11/100)*(VLOOKUP($D11,$B$5:$L$9,F$3,0)))))+(IF((OR(($D12=\"\"),($D12=0))),(0),(($E12/100)*(VLOOKUP($D12,$B$5:$L$9,F$3,0)))))","v":13.123800000000001},{"$f":"(IF((OR(($D10=\"\"),($D10=0))),(0),(($E10/100)*(VLOOKUP($D10,$B$5:$L$9,G$3,0)))))+(IF((OR(($D11=\"\"),($D11=0))),(0),(($E11/100)*(VLOOKUP($D11,$B$5:$L$9,G$3,0)))))+(IF((OR(($D12=\"\"),($D12=0))),(0),(($E12/100)*(VLOOKUP($D12,$B$5:$L$9,G$3,0)))))","v":1.4838},0.8859999999999999,0.47399999999999998,5.5659999999999998,6.4199999999999993E-2,1.2238,{"$f":"IF((C10=\"\"),(0),(F10+G10+1.5*H10+0.5*I10))","v":16.1736},{"$f":"IF((C10=\"\"),(0),(J10+30*K10+0.5*L10))","v":8.1038999999999994}]
{"$rows_left_out":22}
{"sheet":"DELONG","index":4,"n_rows":31,"n_cols":17,"rows_kept":31,"cut":false,"hidden":false,"merged":[[9,8,11,8],[8,2,8,3],[3,2,3,3],[4,2,4,3],[5,2,5,3],[6,2,6,3],[7,2,7,3],[9,1,11,1],[9,2,11,2],[9,5,11,5],[9,6,11,6],[9,7,11,7],[12,1,14,1],[12,2,14,2],[12,5,14,5],[12,6,14,6],[12,7,14,7],[15,1,17,1],[15,2,17,2],[15,5,17,5],[15,6,17,6],[15,7,17,7],[18,1,20,1],[18,2,20,2],[18,5,20,5],[18,6,20,6],[18,7,20,7],[21,1,23,1],[21,2,23,2],[21,5,23,5],[21,6,23,6],[15,13,17,13],[21,7,23,7],[21,8,23,8],[18,8,20,8],[18,9,20,9],[18,10,20,10],[21,9,23,9],[21,10,23,10],[21,12,23,12],[21,13,23,13],[15,11,17,11],[18,11,20,11],[31,3,31,5],[15,14,17,14],[21,14,23,14],[21,11,23,11],[18,12,20,12],[15,8,17,8],[15,9,17,9],[15,10,17,10],[15,12,17,12],[1,7,1,8],[18,13,20,13],[18,14,20,14],[12,13,14,13],[12,14,14,14],[12,8,14,8],[12,9,14,9],[12,10,14,10],[12,12,14,12],[12,11,14,11],[9,9,11,9],[9,10,11,10],[9,12,11,12],[9,13,11,13],[9,14,11,14],[9,11,11,11]]}
[]
[null,"DIAGRAMA DE DELONG",null,null,null,null,null,"CAPA"]
[null,null,null,null,null,5,6,7,8,9,10,11,12]
[null,"Nº","ESPECIFICAÇÃO",null,"TEOR (%)","Cr","Mo","Si","*","Ni","C","N","Mn","Creq.","Nieq."]
[null,1,{"$f":"IF((SCHÄFFLER!C5=\"\"),(\"\"),(SCHÄFFLER!C5))","v":"AÇO ESTRUTURAL CASO HDT"},null,100,{"$f":"SCHÄFFLER!F5","v":5.8730000000000002},{"$f":"SCHÄFFLER!G5","v":1.9730000000000001},{"$f":"SCHÄFFLER!H5","v":1.1599999999999999},{"$f":"SCHÄFFLER!I5","v":0.79},{"$f":"SCHÄFFLER!J5","v":0.61},{"$f":"SCHÄFFLER!K5","v":8.6999999999999994E-2},{"$f":"IF((C5=\"\"),(\"\"),(VLOOKUP(C5,ENTRADA!$C$5:$U$9,14,0)))","v":1.2E-2},{"$f":"SCHÄFFLER!L5","v":0.873},{"$f":"IF((C5=\"\"),(0),(F5+G5+1.5*H5+0.5*I5))","v":9.9809999999999999},{"$f":"IF((C5=\"\"),(0),(J5+30*K5+30*L5+0.5*M5))","v":4.0164999999999997}]
[null,2,{"$f":"IF((SCHÄFFLER!C6=\"\"),(\"\"),(SCHÄFFLER!C6))","v":"AWS ER309L"},null,100,{"$f":"SCHÄFFLER!F6","v":24},{"$f":"SCHÄFFLER!G6","v":0.75},{"$f":"SCHÄFFLER!H6","v":0.47499999999999998},{"$f":"SCHÄFFLER!I6","v":0},{"$f":"SCHÄFFLER!J6","v":13},{"$f":"SCHÄFFLER!K6","v":0.03},{"$f":"IF((C6=\"\"),(\"\"),(VLOOKUP(C6,ENTRADA!$C$5:$U$9,14,0)))","v":0},{"$f":"SCHÄFFLER!L6","v":1.75},{"$f":"IF((C6=\"\"),(0),(F6+G6+1.5*H6+0.5*I6))","v":25.462499999999999},{"$f":"IF((C6=\"\"),(0),(J6+30*K6+30*L6+0.5*M6))","v":14.775}]
[null,3,{"$f":"IF((SCHÄFFLER!C7=\"\"),(\"\"),(SCHÄFFLER!C7))","v":"AWS ER347"},null,100,{"$f":"SCHÄFFLER!F7","v":19},{"$f":"SCHÄFFLER!G7","v":1.2},{"$f":"SCHÄFFLER!H7","v":1.5},{"$f":"SCHÄFFLER!I7","v":0.8},{"$f":"SCHÄFFLER!J7","v":15},{"$f":"SCHÄFFLER!K7","v":0.08},{"$f":"IF((C7=\"\"),(\"\"),(VLOOKUP(C7,ENTRADA!$C$5:$U$9,14,0)))","v":0.13},{"$f":"SCHÄFFLER!L7","v":1},22.849999999999998,21.799999999999997]
[null,4,{"$f":"IF((SCHÄFFLER!C8=\"\"),(\"\"),(SCHÄFFLER!C8))","v":""},null,100,{"$f":"SCHÄFFLER!F8","v":""},{"$f":"SCHÄFFLER!G8","v":""},{"$f":"SCHÄFFLER!H8","v":""},{"$f":"SCHÄFFLER!I8","v":""},{"$f":"SCHÄFFLER!J8","v":""},{"$f":"SCHÄFFLER!K8","v":""},{"$f":"IF((C8=\"\"),(\"\"),(VLOOKUP(C8,ENTRADA!$C$5:$U$9,14,0)))","v":""},{"$f":"SCHÄFFLER!L8","v":""},0,0]
[null,5,{"$f":"IF((SCHÄFFLER!C9=\"\"),(\"\"),(SCHÄFFLER!C9))","v":""},null,100,{"$f":"SCHÄFFLER!F9","v":""},{"$f":"SCHÄFFLER!G9","v":""},{"$f":"SCHÄFFLER!H9","v":""},{"$f":"SCHÄFFLER!I9","v":""},{"$f":"SCHÄFFLER!J9","v":""},{"$f":"SCHÄFFLER!K9","v":""},{"$f":"IF((C9=\"\"),(\"\"),(VLOOKUP(C9,ENTRADA!$C$5:$U$9,14,0)))","v":""},{"$f":"SCHÄFFLER!L9","v":""},0,0]
[null,6,{"$f":"CONCATENATE((D10),(IF((D11=\"\"),(\"\"),(\" + \"))),D11,(IF((D12=\"\"),(\"\"),(\" + \"))),D12)","v":"1 + 2"},1,60,{"$f":"(IF((OR(($D10=\"\"),($D10=0))),(0),(($E10/100)*(VLOOKUP($D10,$B$5:$M$9,F$3,0)))))+(IF((OR(($D11=\"\"),($D11=0))),(0),(($E11/100)*(VLOOKUP($D11,$B$5:$M$9,F$3,0)))))+(IF((OR(($D12=\"\"),($D12=0))),(0),(($E12/100)*(VLOOKUP($D12,$B$5:$M$9,F$3,0)))))","v":13.123800000000001},{"$f":"(IF((OR(($D10=\"\"),($D10=0))),(0),(($E10/100)*(VLOOKUP($D10,$B$5:$M$9,G$3,0)))))+(IF((OR(($D11=\"\"),($D11=0))),(0),(($E11/100)*(VLOOKUP($D11,$B$5:$M$9,G$3,0)))))+(IF((OR(($D12=\"\"),($D12=0))),(0),(($E12/100)*(VLOOKUP($D12,$B$5:$M$9,G$3,0)))))","v":1.4838},0.8859999999999999,0.47399999999999998,5.5659999999999998,6.4199999999999993E-2,{"$f":"(IF((OR(($D10=\"\"),($D10=0))),(0),(($E10/100)*(VLOOKUP($D10,$B$5:$M$9,L$3,0)))))+(IF((OR(($D11=\"\"),($D11=0))),(0),(($E11/100)*(VLOOKUP($D11,$B$5:$M$9,L$3,0)))))+(IF((OR(($D12=\"\"),($D12=0))),(0),(($E12/100)*(VLOOKUP($D12,$B$5:$M$9,L$3,0)))))","v":7.1999999999999998E-3},1.2238,{"$f":"IF((C10=\"\"),(0),(F10+G10+1.5*H10+0.5*I10))","v":16.1736},{"$f":"IF((C10=\"\"),(0),(J10+30*K10+30*L10+0.5*M10))","v":8.3198999999999987}]
{"$rows_left_out":22}
{"sheet":"WRC","index":5,"n_rows":31,"n_cols":17,"rows_kept":31,"cut":false,"hidden":false,"merged":[[31,3,31,5],[21,8,23,8],[21,9,23,9],[21,10,23,10],[21,11,23,11],[21,12,23,12],[21,13,23,13],[21,1,23,1],[21,2,23,2],[21,5,23,5],[21,6,23,6],[21,7,23,7],[18,13,20,13],[18,1,20,1],[18,2,20,2],[18,5,20,5],[18,6,20,6],[18,7,20,7],[18,8,20,8],[18,9,20,9],[18,10,20,10],[18,11,20,11],[18,12,20,12],[15,13,17,13],[15,1,17,1],[15,2,17,2],[15,5,17,5],[15,6,17,6],[15,7,17,7],[15,8,17,8],[15,9,17,9],[15,10,17,10],[15,11,17,11],[15,12,17,12],[12,13,14,13],[12,1,14,1],[12,2,14,2],[12,5,14,5],[12,6,14,6],[12,7,14,7],[12,8,14,8],[12,9,14,9],[12,10,14,10],[12,11,14,11],[12,12,14,12],[9,13,11,13],[9,1,11,1],[9,2,11,2],[9,5,11,5],[9,6,11,6],[9,7,11,7],[9,8,11,8],[9,9,11,9],[9,10,11,10],[9,11,11,11],[9,12,11,12],[1,7,1,8],[8,2,8,3],[3,2,3,3],[4,2,4,3],[5,2,5,3],[6,2,6,3],[7,2,7,3]]}
[]
[null,"DIAGRAMA WRC",null,null,null,null,null,"CAPA"]
[null,null,null,null,null,5,6,7,8,9,10,11]
[null,"Nº","ESPECIFICAÇÃO",null,"TEOR (%)","Cr","Mo","*","Ni","C","N","Cu","Creq.","Nieq."]
[null,1,{"$f":"IF((SCHÄFFLER!C5=\"\"),(\"\"),(SCHÄFFLER!C5))","v":"AÇO ESTRUTURAL CASO HDT"},null,100,{"$f":"SCHÄFFLER!F5","v":5.8730000000000002},{"$f":"SCHÄFFLER!G5","v":1.9730000000000001},{"$f":"SCHÄFFLER!I5","v":0.79},{"$f":"SCHÄFFLER!J5","v":0.61},{"$f":"SCHÄFFLER!K5","v":8.6999999999999994E-2},{"$f":"DELONG!L5","v":1.2E-2},{"$f":"IF((C5=\"\"),(\"\"),(VLOOKUP(C5,ENTRADA!$C$5:$U$9,4,0)))","v":6.3E-2},{"$f":"IF((C5=\"\"),(0),(F5+G5+0.7*H5))","v":8.3990000000000009},{"$f":"IF((C5=\"\"),(0),(I5+35*J5+20*K5+0.25*L5))","v":3.9107499999999997}]
[null,2,{"$f":"IF((SCHÄFFLER!C6=\"\"),(\"\"),(SCHÄFFLER!C6))","v":"AWS ER309L"},null,100,{"$f":"SCHÄFFLER!F6","v":24},{"$f":"SCHÄFFLER!G6","v":0.75},{"$f":"SCHÄFFLER!I6","v":0},{"$f":"SCHÄFFLER!J6","v":13},{"$f":"SCHÄFFLER!K6","v":0.03},{"$f":"DELONG!L6","v":0},{"$f":"IF((C6=\"\"),(\"\"),(VLOOKUP(C6,ENTRADA!$C$5:$U$9,4,0)))","v":0.75},{"$f":"IF((C6=\"\"),(0),(F6+G6+0.7*H6))","v":24.75},{"$f":"IF((C6=\"\"),(0),(I6+35*J6+20*K6+0.25*L6))","v":14.237500000000001}]
[null,3,{"$f":"IF((SCHÄFFLER!C7=\"\"),(\"\"),(SCHÄFFLER!C7))","v":"AWS ER347"},null,100,{"$f":"SCHÄFFLER!F7","v":19},{"$f":"SCHÄFFLER!G7","v":1.2},{"$f":"SCHÄFFLER!I7","v":0.8},{"$f":"SCHÄFFLER!J7","v":15},{"$f":"SCHÄFFLER!K7","v":0.08},{"$f":"DELONG!L7","v":0.13},{"$f":"IF((C7=\"\"),(\"\"),(VLOOKUP(C7,ENTRADA!$C$5:$U$9,4,0)))","v":0},20.759999999999998,20.400000000000002]
[null,4,{"$f":"IF((SCHÄFFLER!C8=\"\"),(\"\"),(SCHÄFFLER!C8))","v":""},null,100,{"$f":"SCHÄFFLER!F8","v":""},{"$f":"SCHÄFFLER!G8","v":""},{"$f":"SCHÄFFLER!I8","v":""},{"$f":"SCHÄFFLER!J8","v":""},{"$f":"SCHÄFFLER!K8","v":""},{"$f":"DELONG!L8","v":""},{"$f":"IF((C8=\"\"),(\"\"),(VLOOKUP(C8,ENTRADA!$C$5:$U$9,4,0)))","v":""},0,0]
[null,5,{"$f":"IF((SCHÄFFLER!C9=\"\"),(\"\"),(SCHÄFFLER!C9))","v":""},null,100,{"$f":"SCHÄFFLER!F9","v":""},{"$f":"SCHÄFFLER!G9","v":""},{"$f":"SCHÄFFLER!I9","v":""},{"$f":"SCHÄFFLER!J9","v":""},{"$f":"SCHÄFFLER!K9","v":""},{"$f":"DELONG!L9","v":""},{"$f":"IF((C9=\"\"),(\"\"),(VLOOKUP(C9,ENTRADA!$C$5:$U$9,4,0)))","v":""},0,{"$f":"IF((C9=\"\"),(0),(I9+35*J9+20*K9+0.25*L9))","v":0}]
[null,6,{"$f":"CONCATENATE((D10),(IF((D11=\"\"),(\"\"),(\" + \"))),D11,(IF((D12=\"\"),(\"\"),(\" + \"))),D12)","v":"1 + 2"},1,60,{"$f":"(IF((OR(($D10=\"\"),($D10=0))),(0),(($E10/100)*(VLOOKUP($D10,$B$5:$L$9,F$3,0)))))+(IF((OR(($D11=\"\"),($D11=0))),(0),(($E11/100)*(VLOOKUP($D11,$B$5:$L$9,F$3,0)))))+(IF((OR(($D12=\"\"),($D12=0))),(0),(($E12/100)*(VLOOKUP($D12,$B$5:$L$9,F$3,0)))))","v":13.123800000000001},1.4838,0.47399999999999998,5.5659999999999998,6.4199999999999993E-2,7.1999999999999998E-3,0.33780000000000004,{"$f":"IF((C10=\"\"),(0),(F10+G10+0.7*H10))","v":14.939400000000001},{"$f":"IF((C10=\"\"),(0),(I10+35*J10+20*K10+0.25*L10))","v":8.0414499999999993}]
{"$rows_left_out":22}
{"sheet":"BALMFORTH","index":6,"n_rows":31,"n_cols":17,"rows_kept":31,"cut":false,"hidden":false,"merged":[[31,3,31,5],[21,9,23,9],[21,10,23,10],[21,11,23,11],[18,9,20,9],[18,10,20,10],[18,11,20,11],[18,1,20,1],[18,2,20,2],[18,5,20,5],[18,6,20,6],[18,7,20,7],[21,13,23,13],[21,1,23,1],[21,2,23,2],[21,5,23,5],[21,6,23,6],[21,7,23,7],[21,8,23,8],[21,12,23,12],[18,12,20,12],[18,13,20,13],[12,8,14,8],[15,9,17,9],[15,10,17,10],[15,11,17,11],[15,12,17,12],[15,13,17,13],[15,8,17,8],[12,9,14,9],[12,10,14,10],[12,11,14,11],[12,12,14,12],[12,13,14,13],[18,8,20,8],[12,1,14,1],[12,2,14,2],[12,5,14,5],[12,6,14,6],[12,7,14,7],[15,1,17,1],[15,2,17,2],[15,5,17,5],[15,6,17,6],[15,7,17,7],[9,13,11,13],[9,1,11,1],[9,2,11,2],[9,5,11,5],[9,6,11,6],[9,7,11,7],[9,8,11,8],[9,9,11,9],[9,10,11,10],[9,11,11,11],[9,12,11,12],[1,7,1,8],[8,2,8,3],[3,2,3,3],[4,2,4,3],[5,2,5,3],[6,2,6,3],[7,2,7,3]]}
[]
[null,"DIAGRAMA DE BALMFORTH",null,null,null,null,null,"CAPA"]
[null,null,null,null,null,5,6,7,8,9,10,11]
[null,"Nº","ESPECIFICAÇÃO",null,"TEOR (%)","Cr","Mo","Si","*","Ni","C","N","Creq.","Nieq."]
[null,1,{"$f":"IF((SCHÄFFLER!C5=\"\"),(\"\"),(SCHÄFFLER!C5))","v":"AÇO ESTRUTURAL CASO HDT"},null,100,{"$f":"SCHÄFFLER!F5","v":5.8730000000000002},{"$f":"SCHÄFFLER!G5","v":1.9730000000000001},{"$f":"SCHÄFFLER!H5","v":1.1599999999999999},{"$f":"SCHÄFFLER!I5","v":0.79},{"$f":"SCHÄFFLER!J5","v":0.61},{"$f":"SCHÄFFLER!K5","v":8.6999999999999994E-2},{"$f":"DELONG!L5","v":1.2E-2},{"$f":"IF((C5=\"\"),(0),(F5+2*G5+1.5*H5+10*I5))","v":19.459000000000003},{"$f":"IF((C5=\"\"),(0),(J5+35*K5+20*L5))","v":3.8949999999999996}]
[null,2,{"$f":"IF((SCHÄFFLER!C6=\"\"),(\"\"),(SCHÄFFLER!C6))","v":"AWS ER309L"},null,100,{"$f":"SCHÄFFLER!F6","v":24},{"$f":"SCHÄFFLER!G6","v":0.75},{"$f":"SCHÄFFLER!H6","v":0.47499999999999998},{"$f":"SCHÄFFLER!I6","v":0},{"$f":"SCHÄFFLER!J6","v":13},{"$f":"SCHÄFFLER!K6","v":0.03},{"$f":"DELONG!L6","v":0},{"$f":"IF((C6=\"\"),(0),(F6+2*G6+1.5*H6+10*I6))","v":26.212499999999999},{"$f":"IF((C6=\"\"),(0),(J6+35*K6+20*L6))","v":14.05}]
[null,3,{"$f":"IF((SCHÄFFLER!C7=\"\"),(\"\"),(SCHÄFFLER!C7))","v":"AWS ER347"},null,100,{"$f":"SCHÄFFLER!F7","v":19},{"$f":"SCHÄFFLER!G7","v":1.2},{"$f":"SCHÄFFLER!H7","v":1.5},{"$f":"SCHÄFFLER!I7","v":0.8},{"$f":"SCHÄFFLER!J7","v":15},{"$f":"SCHÄFFLER!K7","v":0.08},{"$f":"DELONG!L7","v":0.13},31.65,20.400000000000002]
[null,4,{"$f":"IF((SCHÄFFLER!C8=\"\"),(\"\"),(SCHÄFFLER!C8))","v":""},null,100,{"$f":"SCHÄFFLER!F8","v":""},{"$f":"SCHÄFFLER!G8","v":""},{"$f":"SCHÄFFLER!H8","v":""},{"$f":"SCHÄFFLER!I8","v":""},{"$f":"SCHÄFFLER!J8","v":""},{"$f":"SCHÄFFLER!K8","v":""},{"$f":"DELONG!L8","v":""},0,0]
[null,5,{"$f":"IF((SCHÄFFLER!C9=\"\"),(\"\"),(SCHÄFFLER!C9))","v":""},null,100,{"$f":"SCHÄFFLER!F9","v":""},{"$f":"SCHÄFFLER!G9","v":""},{"$f":"SCHÄFFLER!H9","v":""},{"$f":"SCHÄFFLER!I9","v":""},{"$f":"SCHÄFFLER!J9","v":""},{"$f":"SCHÄFFLER!K9","v":""},{"$f":"DELONG!L9","v":""},0,0]
[null,6,{"$f":"CONCATENATE((D10),(IF((D11=\"\"),(\"\"),(\" + \"))),D11,(IF((D12=\"\"),(\"\"),(\" + \"))),D12)","v":"1 + 2"},1,60,{"$f":"(IF((OR(($D10=\"\"),($D10=0))),(0),(($E10/100)*(VLOOKUP($D10,$B$5:$L$9,F$3,0)))))+(IF((OR(($D11=\"\"),($D11=0))),(0),(($E11/100)*(VLOOKUP($D11,$B$5:$L$9,F$3,0)))))+(IF((OR(($D12=\"\"),($D12=0))),(0),(($E12/100)*(VLOOKUP($D12,$B$5:$L$9,F$3,0)))))","v":13.123800000000001},1.4838,0.8859999999999999,0.47399999999999998,5.5659999999999998,6.4199999999999993E-2,7.1999999999999998E-3,{"$f":"IF((C10=\"\"),(0),(F10+2*G10+1.5*H10+10*I10))","v":22.160400000000003},{"$f":"IF((C10=\"\"),(0),(J10+35*K10+20*L10))","v":7.9569999999999999}]
{"$rows_left_out":22}
{"sheet":"Plan2","index":7,"n_rows":35,"n_cols":13,"rows_kept":35,"cut":false,"hidden":true,"merged":[]}
[]
[null,"X","L1","L2","L3","L4","L5"]
[null,0,{"$f":"(-0.8057*(0))+25.4","v":25.4},null,{"$f":"(-3.0435*(0))+7","v":7},{"$f":"(-0.7724*(0))+19","v":19}]
[null,2.2999999999999998,null,null,{"$f":"(-3.0435*(2.3))+7","v":-4.9999999998995293E-5}]
[null,7.6,null,{"$f":"(1.0895*(7.6))-7.7658","v":0.5143999999999993}]
[null,12.5,null,null,null,null,{"$f":"(0.3273*(12.5))-4.0909","v":3.499999999991843E-4}]
[null,14.5]
[null,22,null,null,null,{"$f":"(-0.7724*(22))+19","v":2.007200000000001}]
[null,26,{"$f":"(-0.8057*(26))+25.4","v":4.4517999999999986}]
[null,36.5,null,{"$f":"(1.0895*(36.5))-7.7658","v":32.000949999999996}]
{"$rows_left_out":26}
{"sheet":"MATERIAIS","index":8,"n_rows":81,"n_cols":12,"rows_kept":81,"cut":false,"hidden":false,"merged":[]}
[]
[null,"MATERIAIS DE SOLDA MAIS COMUNS",null,null,"CAPA"]
[]
[null,"ESPECIFICAÇÃO","TIPO","Carbono (C)","Cobre (Cu)","Cromo (Cr)","Manganês (Mn)","Molibdênio (Mo)","Níquel (Ni)","Nitrogênio (N)","Silício (Si)","Outros (Nb, Ti, Al, etc.)"]
[null,"11Cr 2.5Ni","SM",1.0999999999999999E-2,0.48,10.6,1.77,0.06,2.4,6.0000000000000001E-3,0.1,2.4060000000000001]
[null,"12Cr 4.5Ni 1.5Mo","SM",1.7000000000000001E-2,0.51,11.7,1.77,1.39,4.9000000000000004,1.0999999999999999E-2,0.2,4.907]
[null,"12Cr 6.5Ni 2.5Mo","SM",1.7999999999999999E-2,0.49,12.6,1.72,2.3199999999999998,6.5,1.0999999999999999E-2,0.09,6.508]
[null,"AISI 444","F",0.02,0,18,1,2.1,1,0.03,1,0.6]
[null,"ER 317","SF",0.06,0.75,19,1.8,3.5,14,0,0.45,0.6]
[null,"AISI 405","F",0.08,0,12.5,1,0,0,0,1,0.2]
{"$rows_left_out":71}